Registrosgolanggithub.com/prometheus/commonv0.71.0
Qual símbolo rodou onde
Símbolos × sistemas operacionais desta versão. As células levam ao cubo de compatibilidade do pacote.
Mostrando os ambientes com mais evidências.
Como ler uma célula: O número são as observações registradas entre as quais a taxa divide — um build deixa uma observação por etapa que alcançou, então não conta builds, nem máquinas, nem pessoas. O documento ao lado é outro fato, de outra fonte: se existe uma amostra naquela coordenada e como foi a nossa execução dela ali.
- ainda sem amostra nesta coordenada
- há uma amostra aqui e ainda não a executamos nesta coordenada
- há uma amostra aqui e nossa execução nesta coordenada terminou limpa
- há uma amostra aqui e nossa execução nesta coordenada falhou
- há uma amostra aqui e esta coordenada registra ao mesmo tempo uma execução aprovada e uma reprovada
- nada registrado — desconhecido, nem “funciona” nem “quebrado”
- há um nível abaixo desta célula — clique para abrir
Um documento significa que há uma amostra naquela coordenada. Se ela EXISTE é um fato sobre esta versão e esta API e não muda com o sistema operacional, o runtime ou o gerenciador de pacotes; a COR diz como essa amostra rodou no ambiente que você está vendo.
Detalhe do ambiente
Observações no nível do projeto e verificações de símbolo/contrato são contadas separadamente e nunca somadas.
Estas contagens não distinguem como o símbolo foi chamado: sobrecargas, formatos de argumentos e opções são agrupados. O que uma forma de chamada específica faz é provado pelo contrato de uma amostra, não por estes números.
| Ambiente | Confiança | Observações | Verificado | Taxa de aprovação | Peers | Visto por último |
|---|---|---|---|---|---|---|
| go 1.26 · Go · go · linux glibc · docker
Observações: PROJECT_LOAD 2✓ · PROJECT_TEST 2✓ — Uso: USED 2✓ — Verificado: CONTRACT 3✓
|
LOW | 4 +2 | 3 | 100% | 1 · 1✓ | 2026-09-17 |
| go 1.26 · Go · go · linux glibc
Observações: PROJECT_PROCESS 7✓ · PROJECT_TEST 3✓ 1✕ — Uso: USED 5✓ — Verificado: UNKNOWN 0✓ 2✕
|
LOW | 11 +5 | 2 | 77% | 1 | 2026-09-05 |
| node 22.23 · JS · npm · linux glibc
Observações: PROJECT_PROCESS 21✓ — Uso: USED 7✓ — Verificado: UNKNOWN 0✓ 7✕
|
ELEVATED FAILURE | 21 +7 | 7 | 75% | 2 | 2026-09-05 |
Clusters de falha recentes
-
observado UNKNOWN exit 1 ERR_MODULE_NOT_FOUND Lacuna de evidência ×5 v0.33.0 → v0.71.0 executionContext=node · moduleSystem=cjs · os=linux · runtime=node@22.23 github.com/prometheus/common/expfmt.FmtOpenMetrics_1_0_0 sha256:88af852f99a8…node:internal/modules/package_json_reader:<n> · throw new ERR_MODULE_NOT_FOUND(packageName, fileURLToPath(base), null); · ^ …node · unclassified-diagnostic · outer node · gap stage-unknownQualidade da evidência: complete · Variantes de ambiente: 1 · Primeiro registro: 2026-08-29 · Visto por último: 2026-09-05Candidato a reverificação diagnóstica
-
observado PROJECT_TEST exit 1 ×1 v0.71.0 os=linux · runtime=go@1.26 sha256:b6b777e6b2eb…--- FAIL: TestPromslogLevels (0.00s) · === RUN TestPromslogFormats · contract_test.go:<n>: expected default format <str>, got <str> …go/test · test-runner-diagnostic · outer go testQualidade da evidência: complete · Variantes de ambiente: 1 · Primeiro registro: 2026-09-05 · Visto por último: 2026-09-05
-
observado UNKNOWN exit 1 Lacuna de evidência ×1 v0.71.0 os=linux · runtime=go@1.26 github.com/prometheus/common/promslog.Config sha256:042f6e977a16…go: updates to go.mod needed; to update it: · go mod tidygo · unclassified-diagnostic · outer go run · gap stage-unknownQualidade da evidência: complete · Variantes de ambiente: 1 · Primeiro registro: 2026-09-05 · Visto por último: 2026-09-05Candidato a reverificação diagnóstica
-
observado UNKNOWN exit 1 Lacuna de evidência ×1 v0.71.0 executionContext=node · moduleSystem=cjs · os=linux · runtime=node@22.23 github.com/prometheus/common/expfmt.FmtOpenMetrics_1_0_0 sha256:69ab38336834…assertion 1 failed: expected text/plain; version=0.0.4; charset=utf-8, got text/plain; version=0.0.4; charset=utf-8; escaping=underscores · exit status 1go · unclassified-diagnostic · outer go run · gap stage-unknownQualidade da evidência: complete · Variantes de ambiente: 1 · Primeiro registro: 2026-09-05 · Visto por último: 2026-09-05Candidato a reverificação diagnóstica
-
observado UNKNOWN exit 1 Lacuna de evidência ×1 v0.71.0 os=linux · runtime=go@1.26 github.com/prometheus/common/promslog.Config sha256:ccff0aa5ca9d…expected default format logfmt, got · exit status 1go · unclassified-diagnostic · outer go run · gap stage-unknownQualidade da evidência: complete · Variantes de ambiente: 1 · Primeiro registro: 2026-09-05 · Visto por último: 2026-09-05Candidato a reverificação diagnóstica
-
observado UNKNOWN exit 1 ERR_ASSERTION Lacuna de evidência ×1 v0.71.0 executionContext=node · moduleSystem=cjs · os=linux · runtime=node@22.23 github.com/prometheus/common/expfmt.FmtOpenMetrics_1_0_0 sha256:761ce8fa9777…node:assert:<n> · throw new AssertionError(obj); · ^ · AssertionError [ERR_ASSERTION]: Should yield 4 tokens for const answer = 42;node · unclassified-diagnostic · outer node · gap stage-unknownQualidade da evidência: complete · Variantes de ambiente: 1 · Primeiro registro: 2026-09-05 · Visto por último: 2026-09-05Candidato a reverificação diagnóstica
-
observado UNKNOWN exit 1 Lacuna de evidência ×1 v0.71.0 executionContext=node · moduleSystem=cjs · os=linux · runtime=node@22.23 github.com/prometheus/common/expfmt.FmtOpenMetrics_1_0_0 sha256:3b3190f2cd44…doc: cannot find package <str> in any of: · ($GOROOT not set) · <path> (from $GOPATH)go · unclassified-diagnostic · outer go · gap stage-unknownQualidade da evidência: complete · Variantes de ambiente: 1 · Primeiro registro: 2026-09-05 · Visto por último: 2026-09-05Candidato a reverificação diagnóstica
-
observado UNKNOWN exit 1 ERR_ASSERTION Lacuna de evidência ×1 v0.71.0 executionContext=node · moduleSystem=cjs · os=linux · runtime=node@22.23 github.com/prometheus/common/expfmt.FmtOpenMetrics_1_0_0 sha256:986d98189e70…node:internal/modules/run_main:<n> · triggerUncaughtException( · ^ · AssertionError [ERR_ASSERTION]: Expected values to be strictly equal:node · unclassified-diagnostic · outer node · gap stage-unknownQualidade da evidência: complete · Variantes de ambiente: 1 · Primeiro registro: 2026-09-05 · Visto por último: 2026-09-05Candidato a reverificação diagnóstica
-
observado UNKNOWN exit 1 ERR_ASSERTION Lacuna de evidência ×1 v0.71.0 executionContext=node · moduleSystem=cjs · os=linux · runtime=node@22.23 github.com/prometheus/common/expfmt.FmtOpenMetrics_1_0_0 sha256:b820b4edc1a5…node:internal/modules/run_main:<n> · triggerUncaughtException( · ^ · AssertionError [ERR_ASSERTION]: should produce 4 tokens before eof for <str>node · unclassified-diagnostic · outer node · gap stage-unknownQualidade da evidência: complete · Variantes de ambiente: 1 · Primeiro registro: 2026-09-05 · Visto por último: 2026-09-05Candidato a reverificação diagnóstica
-
observado UNKNOWN exit 1 ERR_ASSERTION Lacuna de evidência ×1 v0.71.0 executionContext=node · moduleSystem=cjs · os=linux · runtime=node@22.23 github.com/prometheus/common/expfmt.FmtOpenMetrics_1_0_0 sha256:d5180246550d…node:internal/modules/run_main:<n> · triggerUncaughtException( · ^ · AssertionError [ERR_ASSERTION]: Expected <str> to be reference-equal to <str>:node · unclassified-diagnostic · outer node · gap stage-unknownQualidade da evidência: complete · Variantes de ambiente: 1 · Primeiro registro: 2026-09-05 · Visto por último: 2026-09-05Candidato a reverificação diagnóstica
Símbolos
- github.com/prometheus/common/version.Branch
- github.com/prometheus/common/version.BuildContext
- github.com/prometheus/common/version.BuildDate
- github.com/prometheus/common/version.BuildUser
- github.com/prometheus/common/version.ComponentUserAgent
- github.com/prometheus/common/promslog.Config
- github.com/prometheus/common/expfmt.FmtOpenMetrics_1_0_0 0 de 7 execuções passaram
- github.com/prometheus/common/expfmt.FmtText 0 de 7 execuções passaram
- github.com/prometheus/common/expfmt.Format 0 de 7 execuções passaram
- github.com/prometheus/common/promslog.FormatFlagOptions
- github.com/prometheus/common/version.GetTags
- github.com/prometheus/common/version.GoArch
- github.com/prometheus/common/promslog.GoKitStyle
- github.com/prometheus/common/version.GoOS
- github.com/prometheus/common/version.GoVersion
- github.com/prometheus/common/version.Info
- github.com/prometheus/common/model.LegacyValidation
- github.com/prometheus/common/promslog.LevelFlagOptions
- github.com/prometheus/common/promslog.LogStyle
- github.com/prometheus/common/expfmt.MetricFamilyToText 0 de 3 execuções passaram
- github.com/prometheus/common/expfmt.Negotiate 0 de 7 execuções passaram
- github.com/prometheus/common/expfmt.NegotiateAccept 0 de 7 execuções passaram
- github.com/prometheus/common/promslog.New
- github.com/prometheus/common/expfmt.NewDecoder 0 de 7 execuções passaram
- github.com/prometheus/common/expfmt.NewEncoder 0 de 3 execuções passaram
- github.com/prometheus/common/promslog.NewFormat
- github.com/prometheus/common/promslog.NewLevel
- github.com/prometheus/common/promslog.NewNopLogger
- github.com/prometheus/common/expfmt.NewTextParser
- github.com/prometheus/common/version.Print
- github.com/prometheus/common/version.PrometheusUserAgent
- github.com/prometheus/common/expfmt.ResponseFormat
- github.com/prometheus/common/version.Revision
- github.com/prometheus/common/version.Slog
- github.com/prometheus/common/promslog.SlogStyle
- github.com/prometheus/common/expfmt.TextParser
- github.com/prometheus/common/expfmt.TypeOpenMetrics
- github.com/prometheus/common/expfmt.TypeTextPlain
- github.com/prometheus/common/version.Version
- github.com/prometheus/common/expfmt 1 1 de 1 execuções passaram
- github.com/prometheus/common/promslog 1
- github.com/prometheus/common/version 1