기록golanggithub.com/prometheus/commonv0.71.0
어떤 심볼이 어디서 돌아갔나
이 버전의 심볼 × 운영체제입니다. 셀을 클릭하면 패키지 호환성 큐브로 들어갑니다.
62026-09-05
증거가 가장 많은 환경만 표시합니다.
셀 읽는 법: 숫자는 비율이 딛고 선 기록된 관측 수입니다 — 한 번의 빌드가 도달한 단계마다 관측이 하나씩 남으므로, 빌드 수도 머신 수도 사람 수도 아닙니다. 옆의 문서는 출처가 다른 별개의 사실입니다: 그 좌표에 샘플이 있는지, 그리고 우리가 거기서 실행한 결과가 어떻는지입니다.
- 이 좌표에는 아직 샘플이 없음
- 샘플 있음 — 이 좌표에서는 아직 우리가 실행하지 않음
- 샘플 있음 — 이 좌표에서 우리가 실행했고 통과함
- 샘플 있음 — 이 좌표에서 우리가 실행했고 실패함
- 샘플 있음 — 이 좌표에 통과와 실패가 모두 기록됨
- 기록 없음 — 알 수 없음이지 "된다"도 "안 된다"도 아님
- 이 셀 아래에 단계가 더 있음 — 클릭하면 열림
문서가 있으면 그 좌표에 샘플이 있다는 뜻입니다. 샘플이 존재하는지는 이 버전과 이 API에 대한 사실이라 OS·런타임·패키지 매니저가 바뀌어도 달라지지 않고, 문서의 색은 지금 보고 있는 환경에서 그 샘플이 어떻게 실행됐는지를 말합니다.
환경 상세
프로젝트 수준 관측과 심벌/컨트랙트 검증은 따로 집계하며 절대 합산하지 않습니다.
이 수치는 심볼을 어떻게 호출했는지 구분하지 않습니다. 오버로드, 인자 형태, 옵션이 한데 묶여 집계됩니다. 특정 호출 형태가 어떻게 동작하는지는 이 숫자가 아니라 샘플의 계약이 증명합니다.
| 환경 | 신뢰도 | 관측 | 검증 | 통과율 | 피어 | 마지막 관측 |
|---|---|---|---|---|---|---|
| go 1.26 · Go · go · linux glibc · docker
관측: PROJECT_LOAD 2✓ · PROJECT_TEST 2✓ — 사용: USED 2✓ — 검증: CONTRACT 3✓
|
LOW | 4 +2 | 3 | 100% | 1 · 1✓ | 2026-09-17 |
| go 1.26 · Go · go · linux glibc
관측: PROJECT_PROCESS 7✓ · PROJECT_TEST 3✓ 1✕ — 사용: USED 5✓ — 검증: UNKNOWN 0✓ 2✕
|
LOW | 11 +5 | 2 | 77% | 1 | 2026-09-05 |
| node 22.23 · JS · npm · linux glibc
관측: PROJECT_PROCESS 21✓ — 사용: USED 7✓ — 검증: UNKNOWN 0✓ 7✕
|
ELEVATED FAILURE | 21 +7 | 7 | 75% | 2 | 2026-09-05 |
최근 실패 클러스터
-
관측됨 UNKNOWN exit 1 ERR_MODULE_NOT_FOUND 증거 공백 ×5 v0.33.0 → v0.71.0 executionContext=node · moduleSystem=cjs · os=linux · runtime=node@22.23 github.com/prometheus/common/expfmt.FmtOpenMetrics_1_0_0 sha256:88af852f99a8…node:internal/modules/package_json_reader:<n> · throw new ERR_MODULE_NOT_FOUND(packageName, fileURLToPath(base), null); · ^ …node · unclassified-diagnostic · outer node · gap stage-unknown증거 품질: complete · 환경 변형: 1 · 최초 관측: 2026-08-29 · 마지막 관측: 2026-09-05진단 재검증 후보
-
관측됨 PROJECT_TEST exit 1 ×1 v0.71.0 os=linux · runtime=go@1.26 sha256:b6b777e6b2eb…--- FAIL: TestPromslogLevels (0.00s) · === RUN TestPromslogFormats · contract_test.go:<n>: expected default format <str>, got <str> …go/test · test-runner-diagnostic · outer go test증거 품질: complete · 환경 변형: 1 · 최초 관측: 2026-09-05 · 마지막 관측: 2026-09-05
-
관측됨 UNKNOWN exit 1 증거 공백 ×1 v0.71.0 os=linux · runtime=go@1.26 github.com/prometheus/common/promslog.Config sha256:042f6e977a16…go: updates to go.mod needed; to update it: · go mod tidygo · unclassified-diagnostic · outer go run · gap stage-unknown증거 품질: complete · 환경 변형: 1 · 최초 관측: 2026-09-05 · 마지막 관측: 2026-09-05진단 재검증 후보
-
관측됨 UNKNOWN exit 1 증거 공백 ×1 v0.71.0 executionContext=node · moduleSystem=cjs · os=linux · runtime=node@22.23 github.com/prometheus/common/expfmt.FmtOpenMetrics_1_0_0 sha256:69ab38336834…assertion 1 failed: expected text/plain; version=0.0.4; charset=utf-8, got text/plain; version=0.0.4; charset=utf-8; escaping=underscores · exit status 1go · unclassified-diagnostic · outer go run · gap stage-unknown증거 품질: complete · 환경 변형: 1 · 최초 관측: 2026-09-05 · 마지막 관측: 2026-09-05진단 재검증 후보
-
관측됨 UNKNOWN exit 1 증거 공백 ×1 v0.71.0 os=linux · runtime=go@1.26 github.com/prometheus/common/promslog.Config sha256:ccff0aa5ca9d…expected default format logfmt, got · exit status 1go · unclassified-diagnostic · outer go run · gap stage-unknown증거 품질: complete · 환경 변형: 1 · 최초 관측: 2026-09-05 · 마지막 관측: 2026-09-05진단 재검증 후보
-
관측됨 UNKNOWN exit 1 ERR_ASSERTION 증거 공백 ×1 v0.71.0 executionContext=node · moduleSystem=cjs · os=linux · runtime=node@22.23 github.com/prometheus/common/expfmt.FmtOpenMetrics_1_0_0 sha256:761ce8fa9777…node:assert:<n> · throw new AssertionError(obj); · ^ · AssertionError [ERR_ASSERTION]: Should yield 4 tokens for const answer = 42;node · unclassified-diagnostic · outer node · gap stage-unknown증거 품질: complete · 환경 변형: 1 · 최초 관측: 2026-09-05 · 마지막 관측: 2026-09-05진단 재검증 후보
-
관측됨 UNKNOWN exit 1 증거 공백 ×1 v0.71.0 executionContext=node · moduleSystem=cjs · os=linux · runtime=node@22.23 github.com/prometheus/common/expfmt.FmtOpenMetrics_1_0_0 sha256:3b3190f2cd44…doc: cannot find package <str> in any of: · ($GOROOT not set) · <path> (from $GOPATH)go · unclassified-diagnostic · outer go · gap stage-unknown증거 품질: complete · 환경 변형: 1 · 최초 관측: 2026-09-05 · 마지막 관측: 2026-09-05진단 재검증 후보
-
관측됨 UNKNOWN exit 1 ERR_ASSERTION 증거 공백 ×1 v0.71.0 executionContext=node · moduleSystem=cjs · os=linux · runtime=node@22.23 github.com/prometheus/common/expfmt.FmtOpenMetrics_1_0_0 sha256:986d98189e70…node:internal/modules/run_main:<n> · triggerUncaughtException( · ^ · AssertionError [ERR_ASSERTION]: Expected values to be strictly equal:node · unclassified-diagnostic · outer node · gap stage-unknown증거 품질: complete · 환경 변형: 1 · 최초 관측: 2026-09-05 · 마지막 관측: 2026-09-05진단 재검증 후보
-
관측됨 UNKNOWN exit 1 ERR_ASSERTION 증거 공백 ×1 v0.71.0 executionContext=node · moduleSystem=cjs · os=linux · runtime=node@22.23 github.com/prometheus/common/expfmt.FmtOpenMetrics_1_0_0 sha256:b820b4edc1a5…node:internal/modules/run_main:<n> · triggerUncaughtException( · ^ · AssertionError [ERR_ASSERTION]: should produce 4 tokens before eof for <str>node · unclassified-diagnostic · outer node · gap stage-unknown증거 품질: complete · 환경 변형: 1 · 최초 관측: 2026-09-05 · 마지막 관측: 2026-09-05진단 재검증 후보
-
관측됨 UNKNOWN exit 1 ERR_ASSERTION 증거 공백 ×1 v0.71.0 executionContext=node · moduleSystem=cjs · os=linux · runtime=node@22.23 github.com/prometheus/common/expfmt.FmtOpenMetrics_1_0_0 sha256:d5180246550d…node:internal/modules/run_main:<n> · triggerUncaughtException( · ^ · AssertionError [ERR_ASSERTION]: Expected <str> to be reference-equal to <str>:node · unclassified-diagnostic · outer node · gap stage-unknown증거 품질: complete · 환경 변형: 1 · 최초 관측: 2026-09-05 · 마지막 관측: 2026-09-05진단 재검증 후보
심벌
- github.com/prometheus/common/version.Branch
- github.com/prometheus/common/version.BuildContext
- github.com/prometheus/common/version.BuildDate
- github.com/prometheus/common/version.BuildUser
- github.com/prometheus/common/version.ComponentUserAgent
- github.com/prometheus/common/promslog.Config
- github.com/prometheus/common/expfmt.FmtOpenMetrics_1_0_0 0/7회 통과
- github.com/prometheus/common/expfmt.FmtText 0/7회 통과
- github.com/prometheus/common/expfmt.Format 0/7회 통과
- github.com/prometheus/common/promslog.FormatFlagOptions
- github.com/prometheus/common/version.GetTags
- github.com/prometheus/common/version.GoArch
- github.com/prometheus/common/promslog.GoKitStyle
- github.com/prometheus/common/version.GoOS
- github.com/prometheus/common/version.GoVersion
- github.com/prometheus/common/version.Info
- github.com/prometheus/common/model.LegacyValidation
- github.com/prometheus/common/promslog.LevelFlagOptions
- github.com/prometheus/common/promslog.LogStyle
- github.com/prometheus/common/expfmt.MetricFamilyToText 0/3회 통과
- github.com/prometheus/common/expfmt.Negotiate 0/7회 통과
- github.com/prometheus/common/expfmt.NegotiateAccept 0/7회 통과
- github.com/prometheus/common/promslog.New
- github.com/prometheus/common/expfmt.NewDecoder 0/7회 통과
- github.com/prometheus/common/expfmt.NewEncoder 0/3회 통과
- github.com/prometheus/common/promslog.NewFormat
- github.com/prometheus/common/promslog.NewLevel
- github.com/prometheus/common/promslog.NewNopLogger
- github.com/prometheus/common/expfmt.NewTextParser
- github.com/prometheus/common/version.Print
- github.com/prometheus/common/version.PrometheusUserAgent
- github.com/prometheus/common/expfmt.ResponseFormat
- github.com/prometheus/common/version.Revision
- github.com/prometheus/common/version.Slog
- github.com/prometheus/common/promslog.SlogStyle
- github.com/prometheus/common/expfmt.TextParser
- github.com/prometheus/common/expfmt.TypeOpenMetrics
- github.com/prometheus/common/expfmt.TypeTextPlain
- github.com/prometheus/common/version.Version
- github.com/prometheus/common/expfmt 1 1/1회 통과
- github.com/prometheus/common/promslog 1
- github.com/prometheus/common/version 1