Aufzeichnungengolanggithub.com/prometheus/commonv0.71.0
Welches Symbol wo lief
Symbole × Betriebssysteme für diese Version. Zellen führen in den Kompatibilitätswürfel des Pakets.
Gezeigt werden die Umgebungen mit der meisten Evidenz.
Eine Zelle lesen: Die Zahl sind die aufgezeichneten Beobachtungen, durch die die Rate teilt — ein Build hinterlässt pro erreichter Stufe eine Beobachtung, also zählt sie weder Builds noch Maschinen noch Personen. Das Dokument daneben ist eine andere Tatsache aus einer anderen Quelle: ob an dieser Koordinate ein Sample existiert und wie unser eigener Lauf davon dort ausging.
- an dieser Koordinate noch kein Sample
- hier gibt es ein Sample, und wir haben es an dieser Koordinate noch nicht ausgeführt
- hier gibt es ein Sample, und unser Lauf an dieser Koordinate kam sauber zurück
- hier gibt es ein Sample, und unser Lauf an dieser Koordinate ist fehlgeschlagen
- hier gibt es ein Sample, und an dieser Koordinate sind ein bestandener und ein fehlgeschlagener Lauf verzeichnet
- nichts aufgezeichnet — unbekannt, weder „funktioniert“ noch „defekt“
- unter dieser Zelle liegt eine Ebene — zum Öffnen klicken
Ein Dokument bedeutet: An dieser Koordinate gibt es ein Sample. DASS es existiert, ist eine Aussage über diese Version und diese API und ändert sich nicht mit Betriebssystem, Runtime oder Paketmanager; seine FARBE sagt, wie dieses Sample in der Umgebung gelaufen ist, die Sie gerade ansehen.
Umgebungsdetails
Beobachtungen auf Projektebene und Symbol-/Contract-Verifizierungen werden getrennt gezählt und niemals zusammengerechnet.
Diese Zahlen unterscheiden nicht, wie das Symbol aufgerufen wurde: Überladungen, Argumentformen und Optionen werden zusammengefasst. Was eine bestimmte Aufrufform tut, beweist der Vertrag eines Samples – nicht diese Zahlen.
| Umgebung | Konfidenz | Beobachtungen | Verifiziert | Erfolgsquote | Peers | Zuletzt gesehen |
|---|---|---|---|---|---|---|
| go 1.26 · Go · go · linux glibc · docker
Beobachtungen: PROJECT_LOAD 2✓ · PROJECT_TEST 2✓ — Nutzung: USED 2✓ — Verifiziert: CONTRACT 3✓
|
LOW | 4 +2 | 3 | 100 % | 1 · 1✓ | 2026-09-17 |
| go 1.26 · Go · go · linux glibc
Beobachtungen: PROJECT_PROCESS 7✓ · PROJECT_TEST 3✓ 1✕ — Nutzung: USED 5✓ — Verifiziert: UNKNOWN 0✓ 2✕
|
LOW | 11 +5 | 2 | 77 % | 1 | 2026-09-05 |
| node 22.23 · JS · npm · linux glibc
Beobachtungen: PROJECT_PROCESS 21✓ — Nutzung: USED 7✓ — Verifiziert: UNKNOWN 0✓ 7✕
|
ELEVATED FAILURE | 21 +7 | 7 | 75 % | 2 | 2026-09-05 |
Aktuelle Fehler-Cluster
-
beobachtet UNKNOWN exit 1 ERR_MODULE_NOT_FOUND Beweislücke ×5 v0.33.0 → v0.71.0 executionContext=node · moduleSystem=cjs · os=linux · runtime=node@22.23 github.com/prometheus/common/expfmt.FmtOpenMetrics_1_0_0 sha256:88af852f99a8…node:internal/modules/package_json_reader:<n> · throw new ERR_MODULE_NOT_FOUND(packageName, fileURLToPath(base), null); · ^ …node · unclassified-diagnostic · outer node · gap stage-unknownBeweisqualität: complete · Umgebungsvarianten: 1 · Zuerst erfasst: 2026-08-29 · Zuletzt gesehen: 2026-09-05Kandidat für diagnostische Neuprüfung
-
beobachtet PROJECT_TEST exit 1 ×1 v0.71.0 os=linux · runtime=go@1.26 sha256:b6b777e6b2eb…--- FAIL: TestPromslogLevels (0.00s) · === RUN TestPromslogFormats · contract_test.go:<n>: expected default format <str>, got <str> …go/test · test-runner-diagnostic · outer go testBeweisqualität: complete · Umgebungsvarianten: 1 · Zuerst erfasst: 2026-09-05 · Zuletzt gesehen: 2026-09-05
-
beobachtet UNKNOWN exit 1 Beweislücke ×1 v0.71.0 os=linux · runtime=go@1.26 github.com/prometheus/common/promslog.Config sha256:042f6e977a16…go: updates to go.mod needed; to update it: · go mod tidygo · unclassified-diagnostic · outer go run · gap stage-unknownBeweisqualität: complete · Umgebungsvarianten: 1 · Zuerst erfasst: 2026-09-05 · Zuletzt gesehen: 2026-09-05Kandidat für diagnostische Neuprüfung
-
beobachtet UNKNOWN exit 1 Beweislücke ×1 v0.71.0 executionContext=node · moduleSystem=cjs · os=linux · runtime=node@22.23 github.com/prometheus/common/expfmt.FmtOpenMetrics_1_0_0 sha256:69ab38336834…assertion 1 failed: expected text/plain; version=0.0.4; charset=utf-8, got text/plain; version=0.0.4; charset=utf-8; escaping=underscores · exit status 1go · unclassified-diagnostic · outer go run · gap stage-unknownBeweisqualität: complete · Umgebungsvarianten: 1 · Zuerst erfasst: 2026-09-05 · Zuletzt gesehen: 2026-09-05Kandidat für diagnostische Neuprüfung
-
beobachtet UNKNOWN exit 1 Beweislücke ×1 v0.71.0 os=linux · runtime=go@1.26 github.com/prometheus/common/promslog.Config sha256:ccff0aa5ca9d…expected default format logfmt, got · exit status 1go · unclassified-diagnostic · outer go run · gap stage-unknownBeweisqualität: complete · Umgebungsvarianten: 1 · Zuerst erfasst: 2026-09-05 · Zuletzt gesehen: 2026-09-05Kandidat für diagnostische Neuprüfung
-
beobachtet UNKNOWN exit 1 ERR_ASSERTION Beweislücke ×1 v0.71.0 executionContext=node · moduleSystem=cjs · os=linux · runtime=node@22.23 github.com/prometheus/common/expfmt.FmtOpenMetrics_1_0_0 sha256:761ce8fa9777…node:assert:<n> · throw new AssertionError(obj); · ^ · AssertionError [ERR_ASSERTION]: Should yield 4 tokens for const answer = 42;node · unclassified-diagnostic · outer node · gap stage-unknownBeweisqualität: complete · Umgebungsvarianten: 1 · Zuerst erfasst: 2026-09-05 · Zuletzt gesehen: 2026-09-05Kandidat für diagnostische Neuprüfung
-
beobachtet UNKNOWN exit 1 Beweislücke ×1 v0.71.0 executionContext=node · moduleSystem=cjs · os=linux · runtime=node@22.23 github.com/prometheus/common/expfmt.FmtOpenMetrics_1_0_0 sha256:3b3190f2cd44…doc: cannot find package <str> in any of: · ($GOROOT not set) · <path> (from $GOPATH)go · unclassified-diagnostic · outer go · gap stage-unknownBeweisqualität: complete · Umgebungsvarianten: 1 · Zuerst erfasst: 2026-09-05 · Zuletzt gesehen: 2026-09-05Kandidat für diagnostische Neuprüfung
-
beobachtet UNKNOWN exit 1 ERR_ASSERTION Beweislücke ×1 v0.71.0 executionContext=node · moduleSystem=cjs · os=linux · runtime=node@22.23 github.com/prometheus/common/expfmt.FmtOpenMetrics_1_0_0 sha256:986d98189e70…node:internal/modules/run_main:<n> · triggerUncaughtException( · ^ · AssertionError [ERR_ASSERTION]: Expected values to be strictly equal:node · unclassified-diagnostic · outer node · gap stage-unknownBeweisqualität: complete · Umgebungsvarianten: 1 · Zuerst erfasst: 2026-09-05 · Zuletzt gesehen: 2026-09-05Kandidat für diagnostische Neuprüfung
-
beobachtet UNKNOWN exit 1 ERR_ASSERTION Beweislücke ×1 v0.71.0 executionContext=node · moduleSystem=cjs · os=linux · runtime=node@22.23 github.com/prometheus/common/expfmt.FmtOpenMetrics_1_0_0 sha256:b820b4edc1a5…node:internal/modules/run_main:<n> · triggerUncaughtException( · ^ · AssertionError [ERR_ASSERTION]: should produce 4 tokens before eof for <str>node · unclassified-diagnostic · outer node · gap stage-unknownBeweisqualität: complete · Umgebungsvarianten: 1 · Zuerst erfasst: 2026-09-05 · Zuletzt gesehen: 2026-09-05Kandidat für diagnostische Neuprüfung
-
beobachtet UNKNOWN exit 1 ERR_ASSERTION Beweislücke ×1 v0.71.0 executionContext=node · moduleSystem=cjs · os=linux · runtime=node@22.23 github.com/prometheus/common/expfmt.FmtOpenMetrics_1_0_0 sha256:d5180246550d…node:internal/modules/run_main:<n> · triggerUncaughtException( · ^ · AssertionError [ERR_ASSERTION]: Expected <str> to be reference-equal to <str>:node · unclassified-diagnostic · outer node · gap stage-unknownBeweisqualität: complete · Umgebungsvarianten: 1 · Zuerst erfasst: 2026-09-05 · Zuletzt gesehen: 2026-09-05Kandidat für diagnostische Neuprüfung
Symbole
- github.com/prometheus/common/version.Branch
- github.com/prometheus/common/version.BuildContext
- github.com/prometheus/common/version.BuildDate
- github.com/prometheus/common/version.BuildUser
- github.com/prometheus/common/version.ComponentUserAgent
- github.com/prometheus/common/promslog.Config
- github.com/prometheus/common/expfmt.FmtOpenMetrics_1_0_0 0 von 7 Läufen bestanden
- github.com/prometheus/common/expfmt.FmtText 0 von 7 Läufen bestanden
- github.com/prometheus/common/expfmt.Format 0 von 7 Läufen bestanden
- github.com/prometheus/common/promslog.FormatFlagOptions
- github.com/prometheus/common/version.GetTags
- github.com/prometheus/common/version.GoArch
- github.com/prometheus/common/promslog.GoKitStyle
- github.com/prometheus/common/version.GoOS
- github.com/prometheus/common/version.GoVersion
- github.com/prometheus/common/version.Info
- github.com/prometheus/common/model.LegacyValidation
- github.com/prometheus/common/promslog.LevelFlagOptions
- github.com/prometheus/common/promslog.LogStyle
- github.com/prometheus/common/expfmt.MetricFamilyToText 0 von 3 Läufen bestanden
- github.com/prometheus/common/expfmt.Negotiate 0 von 7 Läufen bestanden
- github.com/prometheus/common/expfmt.NegotiateAccept 0 von 7 Läufen bestanden
- github.com/prometheus/common/promslog.New
- github.com/prometheus/common/expfmt.NewDecoder 0 von 7 Läufen bestanden
- github.com/prometheus/common/expfmt.NewEncoder 0 von 3 Läufen bestanden
- github.com/prometheus/common/promslog.NewFormat
- github.com/prometheus/common/promslog.NewLevel
- github.com/prometheus/common/promslog.NewNopLogger
- github.com/prometheus/common/expfmt.NewTextParser
- github.com/prometheus/common/version.Print
- github.com/prometheus/common/version.PrometheusUserAgent
- github.com/prometheus/common/expfmt.ResponseFormat
- github.com/prometheus/common/version.Revision
- github.com/prometheus/common/version.Slog
- github.com/prometheus/common/promslog.SlogStyle
- github.com/prometheus/common/expfmt.TextParser
- github.com/prometheus/common/expfmt.TypeOpenMetrics
- github.com/prometheus/common/expfmt.TypeTextPlain
- github.com/prometheus/common/version.Version
- github.com/prometheus/common/expfmt 1 1 von 1 Läufen bestanden
- github.com/prometheus/common/promslog 1
- github.com/prometheus/common/version 1