記録golanggithub.com/prometheus/commonv0.71.0
どのシンボルがどこで動いたか
このバージョンのシンボル × OS です。セルをクリックすると、パッケージの互換性キューブに掘り下げられます。
62026-09-05
証拠が最も多い環境を表示しています。
セルの読み方: 数字は割合が依拠する記録済み観測の数です — 1 回のビルドは到達した段階ごとに観測を 1 件残すため、ビルド数でもマシン数でも人数でもありません。隣の文書は出所の異なる別の事実です。その座標にサンプルがあるか、そして私たちがそこで実行した結果がどうだったかです。
- この座標にはまだサンプルがない
- サンプルあり — この座標ではまだ実行していない
- サンプルあり — この座標で実行し、問題なく終わった
- サンプルあり — この座標で実行し、失敗した
- サンプルあり — この座標には成功した実行と失敗した実行の両方が記録されている
- 記録なし — 不明であって「動く」でも「壊れている」でもない
- このセルの下にまだ段階がある — クリックで開く
文書があれば、その座標にサンプルがあるということです。サンプルが存在するかどうかはこのリリースとこの API についての事実で、OS・ランタイム・パッケージマネージャが変わっても変わりません。色は、今見ている環境でそのサンプルがどう実行されたかを示します。
環境の詳細
プロジェクトレベルの観測とシンボル/コントラクト検証は別々に集計し、決して合算しません。
これらの数値は、シンボルがどう呼び出されたかを区別しません。オーバーロード、引数の形、オプションはまとめて集計されます。特定の呼び出し方がどう動くかは、この数値ではなくサンプルの契約が証明します。
| 環境 | 信頼度 | 観測 | 検証 | 成功率 | ピア | 最終観測 |
|---|---|---|---|---|---|---|
| go 1.26 · Go · go · linux glibc · docker
観測: PROJECT_LOAD 2✓ · PROJECT_TEST 2✓ — 使用: USED 2✓ — 検証: CONTRACT 3✓
|
LOW | 4 +2 | 3 | 100% | 1 · 1✓ | 2026-09-17 |
| go 1.26 · Go · go · linux glibc
観測: PROJECT_PROCESS 7✓ · PROJECT_TEST 3✓ 1✕ — 使用: USED 5✓ — 検証: UNKNOWN 0✓ 2✕
|
LOW | 11 +5 | 2 | 77% | 1 | 2026-09-05 |
| node 22.23 · JS · npm · linux glibc
観測: PROJECT_PROCESS 21✓ — 使用: USED 7✓ — 検証: UNKNOWN 0✓ 7✕
|
ELEVATED FAILURE | 21 +7 | 7 | 75% | 2 | 2026-09-05 |
最近の失敗クラスター
-
観測済み UNKNOWN exit 1 ERR_MODULE_NOT_FOUND 証拠の欠落 ×5 v0.33.0 → v0.71.0 executionContext=node · moduleSystem=cjs · os=linux · runtime=node@22.23 github.com/prometheus/common/expfmt.FmtOpenMetrics_1_0_0 sha256:88af852f99a8…node:internal/modules/package_json_reader:<n> · throw new ERR_MODULE_NOT_FOUND(packageName, fileURLToPath(base), null); · ^ …node · unclassified-diagnostic · outer node · gap stage-unknown証拠品質: complete · 環境バリアント: 1 · 初回記録: 2026-08-29 · 最終観測: 2026-09-05診断再検証候補
-
観測済み PROJECT_TEST exit 1 ×1 v0.71.0 os=linux · runtime=go@1.26 sha256:b6b777e6b2eb…--- FAIL: TestPromslogLevels (0.00s) · === RUN TestPromslogFormats · contract_test.go:<n>: expected default format <str>, got <str> …go/test · test-runner-diagnostic · outer go test証拠品質: complete · 環境バリアント: 1 · 初回記録: 2026-09-05 · 最終観測: 2026-09-05
-
観測済み UNKNOWN exit 1 証拠の欠落 ×1 v0.71.0 os=linux · runtime=go@1.26 github.com/prometheus/common/promslog.Config sha256:042f6e977a16…go: updates to go.mod needed; to update it: · go mod tidygo · unclassified-diagnostic · outer go run · gap stage-unknown証拠品質: complete · 環境バリアント: 1 · 初回記録: 2026-09-05 · 最終観測: 2026-09-05診断再検証候補
-
観測済み UNKNOWN exit 1 証拠の欠落 ×1 v0.71.0 executionContext=node · moduleSystem=cjs · os=linux · runtime=node@22.23 github.com/prometheus/common/expfmt.FmtOpenMetrics_1_0_0 sha256:69ab38336834…assertion 1 failed: expected text/plain; version=0.0.4; charset=utf-8, got text/plain; version=0.0.4; charset=utf-8; escaping=underscores · exit status 1go · unclassified-diagnostic · outer go run · gap stage-unknown証拠品質: complete · 環境バリアント: 1 · 初回記録: 2026-09-05 · 最終観測: 2026-09-05診断再検証候補
-
観測済み UNKNOWN exit 1 証拠の欠落 ×1 v0.71.0 os=linux · runtime=go@1.26 github.com/prometheus/common/promslog.Config sha256:ccff0aa5ca9d…expected default format logfmt, got · exit status 1go · unclassified-diagnostic · outer go run · gap stage-unknown証拠品質: complete · 環境バリアント: 1 · 初回記録: 2026-09-05 · 最終観測: 2026-09-05診断再検証候補
-
観測済み UNKNOWN exit 1 ERR_ASSERTION 証拠の欠落 ×1 v0.71.0 executionContext=node · moduleSystem=cjs · os=linux · runtime=node@22.23 github.com/prometheus/common/expfmt.FmtOpenMetrics_1_0_0 sha256:761ce8fa9777…node:assert:<n> · throw new AssertionError(obj); · ^ · AssertionError [ERR_ASSERTION]: Should yield 4 tokens for const answer = 42;node · unclassified-diagnostic · outer node · gap stage-unknown証拠品質: complete · 環境バリアント: 1 · 初回記録: 2026-09-05 · 最終観測: 2026-09-05診断再検証候補
-
観測済み UNKNOWN exit 1 証拠の欠落 ×1 v0.71.0 executionContext=node · moduleSystem=cjs · os=linux · runtime=node@22.23 github.com/prometheus/common/expfmt.FmtOpenMetrics_1_0_0 sha256:3b3190f2cd44…doc: cannot find package <str> in any of: · ($GOROOT not set) · <path> (from $GOPATH)go · unclassified-diagnostic · outer go · gap stage-unknown証拠品質: complete · 環境バリアント: 1 · 初回記録: 2026-09-05 · 最終観測: 2026-09-05診断再検証候補
-
観測済み UNKNOWN exit 1 ERR_ASSERTION 証拠の欠落 ×1 v0.71.0 executionContext=node · moduleSystem=cjs · os=linux · runtime=node@22.23 github.com/prometheus/common/expfmt.FmtOpenMetrics_1_0_0 sha256:986d98189e70…node:internal/modules/run_main:<n> · triggerUncaughtException( · ^ · AssertionError [ERR_ASSERTION]: Expected values to be strictly equal:node · unclassified-diagnostic · outer node · gap stage-unknown証拠品質: complete · 環境バリアント: 1 · 初回記録: 2026-09-05 · 最終観測: 2026-09-05診断再検証候補
-
観測済み UNKNOWN exit 1 ERR_ASSERTION 証拠の欠落 ×1 v0.71.0 executionContext=node · moduleSystem=cjs · os=linux · runtime=node@22.23 github.com/prometheus/common/expfmt.FmtOpenMetrics_1_0_0 sha256:b820b4edc1a5…node:internal/modules/run_main:<n> · triggerUncaughtException( · ^ · AssertionError [ERR_ASSERTION]: should produce 4 tokens before eof for <str>node · unclassified-diagnostic · outer node · gap stage-unknown証拠品質: complete · 環境バリアント: 1 · 初回記録: 2026-09-05 · 最終観測: 2026-09-05診断再検証候補
-
観測済み UNKNOWN exit 1 ERR_ASSERTION 証拠の欠落 ×1 v0.71.0 executionContext=node · moduleSystem=cjs · os=linux · runtime=node@22.23 github.com/prometheus/common/expfmt.FmtOpenMetrics_1_0_0 sha256:d5180246550d…node:internal/modules/run_main:<n> · triggerUncaughtException( · ^ · AssertionError [ERR_ASSERTION]: Expected <str> to be reference-equal to <str>:node · unclassified-diagnostic · outer node · gap stage-unknown証拠品質: complete · 環境バリアント: 1 · 初回記録: 2026-09-05 · 最終観測: 2026-09-05診断再検証候補
シンボル
- github.com/prometheus/common/version.Branch
- github.com/prometheus/common/version.BuildContext
- github.com/prometheus/common/version.BuildDate
- github.com/prometheus/common/version.BuildUser
- github.com/prometheus/common/version.ComponentUserAgent
- github.com/prometheus/common/promslog.Config
- github.com/prometheus/common/expfmt.FmtOpenMetrics_1_0_0 0/7 回通過
- github.com/prometheus/common/expfmt.FmtText 0/7 回通過
- github.com/prometheus/common/expfmt.Format 0/7 回通過
- github.com/prometheus/common/promslog.FormatFlagOptions
- github.com/prometheus/common/version.GetTags
- github.com/prometheus/common/version.GoArch
- github.com/prometheus/common/promslog.GoKitStyle
- github.com/prometheus/common/version.GoOS
- github.com/prometheus/common/version.GoVersion
- github.com/prometheus/common/version.Info
- github.com/prometheus/common/model.LegacyValidation
- github.com/prometheus/common/promslog.LevelFlagOptions
- github.com/prometheus/common/promslog.LogStyle
- github.com/prometheus/common/expfmt.MetricFamilyToText 0/3 回通過
- github.com/prometheus/common/expfmt.Negotiate 0/7 回通過
- github.com/prometheus/common/expfmt.NegotiateAccept 0/7 回通過
- github.com/prometheus/common/promslog.New
- github.com/prometheus/common/expfmt.NewDecoder 0/7 回通過
- github.com/prometheus/common/expfmt.NewEncoder 0/3 回通過
- github.com/prometheus/common/promslog.NewFormat
- github.com/prometheus/common/promslog.NewLevel
- github.com/prometheus/common/promslog.NewNopLogger
- github.com/prometheus/common/expfmt.NewTextParser
- github.com/prometheus/common/version.Print
- github.com/prometheus/common/version.PrometheusUserAgent
- github.com/prometheus/common/expfmt.ResponseFormat
- github.com/prometheus/common/version.Revision
- github.com/prometheus/common/version.Slog
- github.com/prometheus/common/promslog.SlogStyle
- github.com/prometheus/common/expfmt.TextParser
- github.com/prometheus/common/expfmt.TypeOpenMetrics
- github.com/prometheus/common/expfmt.TypeTextPlain
- github.com/prometheus/common/version.Version
- github.com/prometheus/common/expfmt 1 1/1 回通過
- github.com/prometheus/common/promslog 1
- github.com/prometheus/common/version 1