Relevésgolanggithub.com/prometheus/commonv0.71.0
Quel symbole a tourné où
Symboles × systèmes d'exploitation pour cette version. Les cellules mènent au cube de compatibilité du paquet.
Les environnements avec le plus de preuves sont affichés.
Lire une cellule : Le nombre, ce sont les observations enregistrées que le taux divise : une compilation dépose une observation par étape atteinte, ce n'est donc ni un nombre de builds, ni de machines, ni de personnes. Le document à côté est un autre fait, d'une autre source : l'existence d'un échantillon à cette coordonnée, et le résultat de notre exécution là-bas.
- pas encore d'échantillon à cette coordonnée
- il y a un échantillon ici et nous ne l'avons pas encore exécuté à cette coordonnée
- il y a un échantillon ici et notre exécution à cette coordonnée s'est terminée proprement
- il y a un échantillon ici et notre exécution à cette coordonnée a échoué
- il y a un échantillon ici et cette coordonnée enregistre à la fois une exécution réussie et une exécution en échec
- rien enregistré — inconnu, ni « fonctionne » ni « cassé »
- il y a un niveau sous cette case — cliquez pour l'ouvrir
Un document signifie qu'il y a un échantillon à cette coordonnée. Son EXISTENCE est un fait sur cette version et cette API et ne change pas avec l'OS, le runtime ou le gestionnaire de paquets ; sa COULEUR dit comment cet échantillon s'est exécuté dans l'environnement que vous regardez.
Détail de l'environnement
Les observations au niveau projet et les vérifications de symbole/contrat sont comptées séparément et jamais additionnées.
Ces chiffres ne distinguent pas la façon dont le symbole a été appelé : surcharges, formes d'arguments et options sont regroupées. Ce que fait une forme d'appel précise est prouvé par le contrat d'un échantillon, pas par ces nombres.
| Environnement | Confiance | Observations | Vérifié | Taux de réussite | Pairs | Dernière observation |
|---|---|---|---|---|---|---|
| go 1.26 · Go · go · linux glibc · docker
Observations: PROJECT_LOAD 2✓ · PROJECT_TEST 2✓ — Usage: USED 2✓ — Vérifié: CONTRACT 3✓
|
LOW | 4 +2 | 3 | 100 % | 1 · 1✓ | 2026-09-17 |
| go 1.26 · Go · go · linux glibc
Observations: PROJECT_PROCESS 7✓ · PROJECT_TEST 3✓ 1✕ — Usage: USED 5✓ — Vérifié: UNKNOWN 0✓ 2✕
|
LOW | 11 +5 | 2 | 77 % | 1 | 2026-09-05 |
| node 22.23 · JS · npm · linux glibc
Observations: PROJECT_PROCESS 21✓ — Usage: USED 7✓ — Vérifié: UNKNOWN 0✓ 7✕
|
ELEVATED FAILURE | 21 +7 | 7 | 75 % | 2 | 2026-09-05 |
Clusters d'échecs récents
-
observé UNKNOWN exit 1 ERR_MODULE_NOT_FOUND Lacune de preuve ×5 v0.33.0 → v0.71.0 executionContext=node · moduleSystem=cjs · os=linux · runtime=node@22.23 github.com/prometheus/common/expfmt.FmtOpenMetrics_1_0_0 sha256:88af852f99a8…node:internal/modules/package_json_reader:<n> · throw new ERR_MODULE_NOT_FOUND(packageName, fileURLToPath(base), null); · ^ …node · unclassified-diagnostic · outer node · gap stage-unknownQualité de preuve: complete · Variantes d’environnement: 1 · Premier relevé: 2026-08-29 · Dernière observation: 2026-09-05Candidat à une revérification diagnostique
-
observé PROJECT_TEST exit 1 ×1 v0.71.0 os=linux · runtime=go@1.26 sha256:b6b777e6b2eb…--- FAIL: TestPromslogLevels (0.00s) · === RUN TestPromslogFormats · contract_test.go:<n>: expected default format <str>, got <str> …go/test · test-runner-diagnostic · outer go testQualité de preuve: complete · Variantes d’environnement: 1 · Premier relevé: 2026-09-05 · Dernière observation: 2026-09-05
-
observé UNKNOWN exit 1 Lacune de preuve ×1 v0.71.0 os=linux · runtime=go@1.26 github.com/prometheus/common/promslog.Config sha256:042f6e977a16…go: updates to go.mod needed; to update it: · go mod tidygo · unclassified-diagnostic · outer go run · gap stage-unknownQualité de preuve: complete · Variantes d’environnement: 1 · Premier relevé: 2026-09-05 · Dernière observation: 2026-09-05Candidat à une revérification diagnostique
-
observé UNKNOWN exit 1 Lacune de preuve ×1 v0.71.0 executionContext=node · moduleSystem=cjs · os=linux · runtime=node@22.23 github.com/prometheus/common/expfmt.FmtOpenMetrics_1_0_0 sha256:69ab38336834…assertion 1 failed: expected text/plain; version=0.0.4; charset=utf-8, got text/plain; version=0.0.4; charset=utf-8; escaping=underscores · exit status 1go · unclassified-diagnostic · outer go run · gap stage-unknownQualité de preuve: complete · Variantes d’environnement: 1 · Premier relevé: 2026-09-05 · Dernière observation: 2026-09-05Candidat à une revérification diagnostique
-
observé UNKNOWN exit 1 Lacune de preuve ×1 v0.71.0 os=linux · runtime=go@1.26 github.com/prometheus/common/promslog.Config sha256:ccff0aa5ca9d…expected default format logfmt, got · exit status 1go · unclassified-diagnostic · outer go run · gap stage-unknownQualité de preuve: complete · Variantes d’environnement: 1 · Premier relevé: 2026-09-05 · Dernière observation: 2026-09-05Candidat à une revérification diagnostique
-
observé UNKNOWN exit 1 ERR_ASSERTION Lacune de preuve ×1 v0.71.0 executionContext=node · moduleSystem=cjs · os=linux · runtime=node@22.23 github.com/prometheus/common/expfmt.FmtOpenMetrics_1_0_0 sha256:761ce8fa9777…node:assert:<n> · throw new AssertionError(obj); · ^ · AssertionError [ERR_ASSERTION]: Should yield 4 tokens for const answer = 42;node · unclassified-diagnostic · outer node · gap stage-unknownQualité de preuve: complete · Variantes d’environnement: 1 · Premier relevé: 2026-09-05 · Dernière observation: 2026-09-05Candidat à une revérification diagnostique
-
observé UNKNOWN exit 1 Lacune de preuve ×1 v0.71.0 executionContext=node · moduleSystem=cjs · os=linux · runtime=node@22.23 github.com/prometheus/common/expfmt.FmtOpenMetrics_1_0_0 sha256:3b3190f2cd44…doc: cannot find package <str> in any of: · ($GOROOT not set) · <path> (from $GOPATH)go · unclassified-diagnostic · outer go · gap stage-unknownQualité de preuve: complete · Variantes d’environnement: 1 · Premier relevé: 2026-09-05 · Dernière observation: 2026-09-05Candidat à une revérification diagnostique
-
observé UNKNOWN exit 1 ERR_ASSERTION Lacune de preuve ×1 v0.71.0 executionContext=node · moduleSystem=cjs · os=linux · runtime=node@22.23 github.com/prometheus/common/expfmt.FmtOpenMetrics_1_0_0 sha256:986d98189e70…node:internal/modules/run_main:<n> · triggerUncaughtException( · ^ · AssertionError [ERR_ASSERTION]: Expected values to be strictly equal:node · unclassified-diagnostic · outer node · gap stage-unknownQualité de preuve: complete · Variantes d’environnement: 1 · Premier relevé: 2026-09-05 · Dernière observation: 2026-09-05Candidat à une revérification diagnostique
-
observé UNKNOWN exit 1 ERR_ASSERTION Lacune de preuve ×1 v0.71.0 executionContext=node · moduleSystem=cjs · os=linux · runtime=node@22.23 github.com/prometheus/common/expfmt.FmtOpenMetrics_1_0_0 sha256:b820b4edc1a5…node:internal/modules/run_main:<n> · triggerUncaughtException( · ^ · AssertionError [ERR_ASSERTION]: should produce 4 tokens before eof for <str>node · unclassified-diagnostic · outer node · gap stage-unknownQualité de preuve: complete · Variantes d’environnement: 1 · Premier relevé: 2026-09-05 · Dernière observation: 2026-09-05Candidat à une revérification diagnostique
-
observé UNKNOWN exit 1 ERR_ASSERTION Lacune de preuve ×1 v0.71.0 executionContext=node · moduleSystem=cjs · os=linux · runtime=node@22.23 github.com/prometheus/common/expfmt.FmtOpenMetrics_1_0_0 sha256:d5180246550d…node:internal/modules/run_main:<n> · triggerUncaughtException( · ^ · AssertionError [ERR_ASSERTION]: Expected <str> to be reference-equal to <str>:node · unclassified-diagnostic · outer node · gap stage-unknownQualité de preuve: complete · Variantes d’environnement: 1 · Premier relevé: 2026-09-05 · Dernière observation: 2026-09-05Candidat à une revérification diagnostique
Symboles
- github.com/prometheus/common/version.Branch
- github.com/prometheus/common/version.BuildContext
- github.com/prometheus/common/version.BuildDate
- github.com/prometheus/common/version.BuildUser
- github.com/prometheus/common/version.ComponentUserAgent
- github.com/prometheus/common/promslog.Config
- github.com/prometheus/common/expfmt.FmtOpenMetrics_1_0_0 0 exécutions sur 7 réussies
- github.com/prometheus/common/expfmt.FmtText 0 exécutions sur 7 réussies
- github.com/prometheus/common/expfmt.Format 0 exécutions sur 7 réussies
- github.com/prometheus/common/promslog.FormatFlagOptions
- github.com/prometheus/common/version.GetTags
- github.com/prometheus/common/version.GoArch
- github.com/prometheus/common/promslog.GoKitStyle
- github.com/prometheus/common/version.GoOS
- github.com/prometheus/common/version.GoVersion
- github.com/prometheus/common/version.Info
- github.com/prometheus/common/model.LegacyValidation
- github.com/prometheus/common/promslog.LevelFlagOptions
- github.com/prometheus/common/promslog.LogStyle
- github.com/prometheus/common/expfmt.MetricFamilyToText 0 exécutions sur 3 réussies
- github.com/prometheus/common/expfmt.Negotiate 0 exécutions sur 7 réussies
- github.com/prometheus/common/expfmt.NegotiateAccept 0 exécutions sur 7 réussies
- github.com/prometheus/common/promslog.New
- github.com/prometheus/common/expfmt.NewDecoder 0 exécutions sur 7 réussies
- github.com/prometheus/common/expfmt.NewEncoder 0 exécutions sur 3 réussies
- github.com/prometheus/common/promslog.NewFormat
- github.com/prometheus/common/promslog.NewLevel
- github.com/prometheus/common/promslog.NewNopLogger
- github.com/prometheus/common/expfmt.NewTextParser
- github.com/prometheus/common/version.Print
- github.com/prometheus/common/version.PrometheusUserAgent
- github.com/prometheus/common/expfmt.ResponseFormat
- github.com/prometheus/common/version.Revision
- github.com/prometheus/common/version.Slog
- github.com/prometheus/common/promslog.SlogStyle
- github.com/prometheus/common/expfmt.TextParser
- github.com/prometheus/common/expfmt.TypeOpenMetrics
- github.com/prometheus/common/expfmt.TypeTextPlain
- github.com/prometheus/common/version.Version
- github.com/prometheus/common/expfmt 1 1 exécutions sur 1 réussies
- github.com/prometheus/common/promslog 1
- github.com/prometheus/common/version 1