Записиnpmvite5.4.14
Какой символ где выполнялся
Символы × операционные системы для этой версии. Ячейки ведут в куб совместимости пакета.
| debian glibc | ubuntu glibc | |
|---|---|---|
| build | 100%2 | 100%1 |
| vite.build | 100%1 | 100%1 |
| vite.createServer | 100%1 | 100%4 |
| vite.loadEnv | 100%1 | 100%3 |
| vite.mergeConfig | 100%1 | 100%2 |
| vite.resolveConfig | 100%1 | 100%2 |
Как читать ячейку: Число — это записанные наблюдения, на которые делится доля: одна сборка оставляет по наблюдению на каждый достигнутый этап, поэтому это не число сборок, не число машин и не число людей. Документ рядом — другой факт из другого источника: есть ли в этой координате образец и чем закончился наш запуск его там.
- в этой координате образца пока нет
- образец есть — в этой координате мы его ещё не запускали
- образец есть — наш запуск в этой координате завершился чисто
- образец есть — наш запуск в этой координате не прошёл
- образец есть — в этой координате записаны и успешный, и неуспешный запуск
- ничего не записано — неизвестно, а не «работает» и не «сломано»
- под этой ячейкой есть уровень — нажмите, чтобы открыть
Документ означает, что в этой координате есть образец. Его НАЛИЧИЕ — это факт об этой версии и этом API, оно не меняется от ОС, среды выполнения или пакетного менеджера; ЦВЕТ говорит, как этот образец отработал в том окружении, которое вы сейчас смотрите.
Детали окружения
Наблюдения уровня проекта и проверки символов/контрактов считаются раздельно и никогда не суммируются.
Эти числа не различают, как именно был вызван символ: перегрузки, наборы аргументов и опции считаются вместе. Что делает конкретная форма вызова, доказывает контракт образца, а не эти цифры.
| Окружение | Достоверность | Наблюдения | Проверено | Доля успешных | Пиры | Последнее наблюдение |
|---|---|---|---|---|---|---|
| node 22 · JS · npm · linux glibc · docker
Наблюдения: PROJECT_LOAD 2✓ · PROJECT_TEST 2✓ — Использование: USED 2✓ — Проверено: CONTRACT 4✓
|
LOW | 4 +2 | 4 | 100 % | 1 · 1✓ | 2026-09-17 |
| node 22 · JS · npm · linux glibc · docker
Наблюдения: PROJECT_LOAD 2✓ · PROJECT_TEST 2✓ — Использование: USED 2✓ — Проверено: CONTRACT 4✓
|
LOW | 4 +2 | 4 | 100 % | 1 · 1✓ | 2026-09-17 |
| node 22.23 · JS · npm · linux glibc
Наблюдения: PROJECT_PROCESS 9✓ — Использование: USED 1✓ — Проверено: UNKNOWN 0✓ 4✕
|
ELEVATED FAILURE | 9 +1 | 4 | 69 % | 3 | 2026-09-07 |
| node 22.23 · JS · npm · linux glibc
Наблюдения: PROJECT_PROCESS 7✓ — Проверено: UNKNOWN 0✓ 2✕
|
MEDIUM | 7 | 2 | 78 % | 2 | 2026-09-07 |
Недавние кластеры сбоев
-
наблюдалось UNKNOWN exit 1 ERR_MODULE_NOT_FOUND Пробел в данных ×3 5.4.14 → 7.3.6 executionContext=node · moduleSystem=cjs · os=linux · runtime=node@22.23 sha256:88af852f99a8…node:internal/modules/package_json_reader:<n> · throw new ERR_MODULE_NOT_FOUND(packageName, fileURLToPath(base), null); · ^ …node · unclassified-diagnostic · outer node · gap stage-unknownКачество данных: complete · Варианты среды: 1 · Первая запись: 2026-09-07 · Последнее наблюдение: 2026-09-14Кандидат на диагностическую перепроверку
-
наблюдалось UNKNOWN exit 1 Пробел в данных ×2 5.4.14 → 5.4.21 executionContext=node · moduleSystem=cjs · os=linux · runtime=node@22.23 vite.resolveConfig sha256:91ad26545eb1…node:internal/modules/cjs/loader:<n> · throw err; · ^ · Error: Cannot find module <str>node · unclassified-diagnostic · outer node · gap stage-unknownКачество данных: complete · Варианты среды: 1 · Первая запись: 2026-08-31 · Последнее наблюдение: 2026-09-07Кандидат на диагностическую перепроверку
-
наблюдалось UNKNOWN exit 1 Пробел в данных ×1 5.4.14 executionContext=node · moduleSystem=cjs · os=linux · runtime=node@22.23 vite.createServer sha256:148f04041544…atomic: true, · followSymlinks: true, · awaitWriteFinish: false · },node · unclassified-diagnostic · outer node · gap stage-unknownКачество данных: complete · Варианты среды: 1 · Первая запись: 2026-09-07 · Последнее наблюдение: 2026-09-07Кандидат на диагностическую перепроверку
-
наблюдалось UNKNOWN exit 1 ERR_ASSERTION Пробел в данных ×1 5.4.14 executionContext=node · moduleSystem=esm · os=linux · runtime=node@22.23 vite.mergeConfig sha256:43caf7a060e7…node:internal/modules/run_main:<n> · triggerUncaughtException( · ^ · AssertionError [ERR_ASSERTION]: Expected values to be strictly deep-equal:node · unclassified-diagnostic · outer node · gap stage-unknownКачество данных: complete · Варианты среды: 1 · Первая запись: 2026-09-07 · Последнее наблюдение: 2026-09-07Кандидат на диагностическую перепроверку
-
наблюдалось UNKNOWN exit 1 ERR_ASSERTION Пробел в данных ×1 5.4.14 executionContext=node · moduleSystem=esm · os=linux · runtime=node@22.23 vite.build sha256:a135683647c7…Test failed: AssertionError [ERR_ASSERTION]: Chunk should contain replaced define constant · at runTest (<url>) …node · unclassified-diagnostic · outer node · gap stage-unknownКачество данных: complete · Варианты среды: 1 · Первая запись: 2026-09-07 · Последнее наблюдение: 2026-09-07Кандидат на диагностическую перепроверку
-
наблюдалось UNKNOWN exit 1 ERR_OUTDATED_OPTIMIZED_DEP Пробел в данных ×1 5.4.14 executionContext=node · moduleSystem=cjs · os=linux · runtime=node@22.23 vite.createServer sha256:f55a6b191c8a…fil<path>:<n> · const err = new Error( · ^ · Error: There is a new version of the pre-bundle for <str>, a page reload is going to ask for it.node · unclassified-diagnostic · outer node · gap stage-unknownКачество данных: complete · Варианты среды: 1 · Первая запись: 2026-09-07 · Последнее наблюдение: 2026-09-07Кандидат на диагностическую перепроверку
Символы
- vite.build 2 пройдено 1 из 2 запусков
- vite.createServer 1 пройдено 1 из 3 запусков
- vite.loadEnv 1 пройдено 1 из 1 запусков
- vite.mergeConfig 1 пройдено 1 из 2 запусков
- vite.resolveConfig 1 пройдено 1 из 2 запусков
Опубликованные примеры
- vite 5.4.14 Эта сеть предлагает одно: образец, который собирается. Она запустила его в песочнице и сохранила подписанную квитанцию. Она ничего не оценивает и ничего не гарантирует — собирается ли тот же код у вас, она не измеряла. HOWnode 22.23.2 MIT-0 · 2026-09-07
- vite 5.4.14 Эта сеть предлагает одно: образец, который собирается. Она запустила его в песочнице и сохранила подписанную квитанцию. Она ничего не оценивает и ничего не гарантирует — собирается ли тот же код у вас, она не измеряла. HOWnode 22.23.2 MIT-0 · 2026-09-07