Registrosnpmvite5.4.14
Qué símbolo se ejecutó dónde
Símbolos × sistemas operativos para esta versión. Las celdas llevan al cubo de compatibilidad del paquete.
| debian glibc | ubuntu glibc | |
|---|---|---|
| build | 100%2 | 100%1 |
| vite.build | 100%1 | 100%1 |
| vite.createServer | 100%1 | 100%4 |
| vite.loadEnv | 100%1 | 100%3 |
| vite.mergeConfig | 100%1 | 100%2 |
| vite.resolveConfig | 100%1 | 100%2 |
Cómo leer una celda: El número son las observaciones registradas entre las que divide la tasa: una compilación deja una observación por cada etapa que alcanzó, así que no cuenta compilaciones, ni máquinas, ni personas. El documento de al lado es otro hecho de otra fuente: si hay una muestra en esa coordenada y cómo fue nuestra ejecución de ella allí.
- todavía no hay muestra en esta coordenada
- hay una muestra aquí y todavía no la hemos ejecutado en esta coordenada
- hay una muestra aquí y nuestra ejecución en esta coordenada terminó limpia
- hay una muestra aquí y nuestra ejecución en esta coordenada falló
- hay una muestra aquí y esta coordenada registra a la vez una ejecución con éxito y otra con fallo
- nada registrado — desconocido, ni «funciona» ni «roto»
- hay un nivel bajo esta celda: haz clic para abrirlo
Un documento significa que hay una muestra en esa coordenada. Que EXISTA es un hecho sobre esta versión y esta API y no cambia con el sistema operativo, el runtime ni el gestor de paquetes; su COLOR es cómo se ejecutó esa muestra en el entorno que estás mirando.
Detalle del entorno
Las observaciones a nivel de proyecto y las verificaciones de símbolo/contrato se cuentan por separado y nunca se combinan.
Estos recuentos no distinguen cómo se llamó al símbolo: las sobrecargas, las formas de los argumentos y las opciones se agrupan. Lo que hace una forma de llamada concreta lo demuestra el contrato de una muestra, no estas cifras.
| Entorno | Confianza | Observaciones | Verificado | Tasa de éxito | Pares | Última observación |
|---|---|---|---|---|---|---|
| node 22 · JS · npm · linux glibc · docker
Observaciones: PROJECT_LOAD 2✓ · PROJECT_TEST 2✓ — Uso: USED 2✓ — Verificado: CONTRACT 4✓
|
LOW | 4 +2 | 4 | 100% | 1 · 1✓ | 2026-09-17 |
| node 22 · JS · npm · linux glibc · docker
Observaciones: PROJECT_LOAD 2✓ · PROJECT_TEST 2✓ — Uso: USED 2✓ — Verificado: CONTRACT 4✓
|
LOW | 4 +2 | 4 | 100% | 1 · 1✓ | 2026-09-17 |
| node 22.23 · JS · npm · linux glibc
Observaciones: PROJECT_PROCESS 9✓ — Uso: USED 1✓ — Verificado: UNKNOWN 0✓ 4✕
|
ELEVATED FAILURE | 9 +1 | 4 | 69% | 3 | 2026-09-07 |
| node 22.23 · JS · npm · linux glibc
Observaciones: PROJECT_PROCESS 7✓ — Verificado: UNKNOWN 0✓ 2✕
|
MEDIUM | 7 | 2 | 78% | 2 | 2026-09-07 |
Clústeres de fallos recientes
-
observado UNKNOWN exit 1 ERR_MODULE_NOT_FOUND Brecha de evidencia ×3 5.4.14 → 7.3.6 executionContext=node · moduleSystem=cjs · os=linux · runtime=node@22.23 sha256:88af852f99a8…node:internal/modules/package_json_reader:<n> · throw new ERR_MODULE_NOT_FOUND(packageName, fileURLToPath(base), null); · ^ …node · unclassified-diagnostic · outer node · gap stage-unknownCalidad de evidencia: complete · Variantes de entorno: 1 · Primer registro: 2026-09-07 · Última observación: 2026-09-14Candidato a reverificación diagnóstica
-
observado UNKNOWN exit 1 Brecha de evidencia ×2 5.4.14 → 5.4.21 executionContext=node · moduleSystem=cjs · os=linux · runtime=node@22.23 vite.resolveConfig sha256:91ad26545eb1…node:internal/modules/cjs/loader:<n> · throw err; · ^ · Error: Cannot find module <str>node · unclassified-diagnostic · outer node · gap stage-unknownCalidad de evidencia: complete · Variantes de entorno: 1 · Primer registro: 2026-08-31 · Última observación: 2026-09-07Candidato a reverificación diagnóstica
-
observado UNKNOWN exit 1 Brecha de evidencia ×1 5.4.14 executionContext=node · moduleSystem=cjs · os=linux · runtime=node@22.23 vite.createServer sha256:148f04041544…atomic: true, · followSymlinks: true, · awaitWriteFinish: false · },node · unclassified-diagnostic · outer node · gap stage-unknownCalidad de evidencia: complete · Variantes de entorno: 1 · Primer registro: 2026-09-07 · Última observación: 2026-09-07Candidato a reverificación diagnóstica
-
observado UNKNOWN exit 1 ERR_ASSERTION Brecha de evidencia ×1 5.4.14 executionContext=node · moduleSystem=esm · os=linux · runtime=node@22.23 vite.mergeConfig sha256:43caf7a060e7…node:internal/modules/run_main:<n> · triggerUncaughtException( · ^ · AssertionError [ERR_ASSERTION]: Expected values to be strictly deep-equal:node · unclassified-diagnostic · outer node · gap stage-unknownCalidad de evidencia: complete · Variantes de entorno: 1 · Primer registro: 2026-09-07 · Última observación: 2026-09-07Candidato a reverificación diagnóstica
-
observado UNKNOWN exit 1 ERR_ASSERTION Brecha de evidencia ×1 5.4.14 executionContext=node · moduleSystem=esm · os=linux · runtime=node@22.23 vite.build sha256:a135683647c7…Test failed: AssertionError [ERR_ASSERTION]: Chunk should contain replaced define constant · at runTest (<url>) …node · unclassified-diagnostic · outer node · gap stage-unknownCalidad de evidencia: complete · Variantes de entorno: 1 · Primer registro: 2026-09-07 · Última observación: 2026-09-07Candidato a reverificación diagnóstica
-
observado UNKNOWN exit 1 ERR_OUTDATED_OPTIMIZED_DEP Brecha de evidencia ×1 5.4.14 executionContext=node · moduleSystem=cjs · os=linux · runtime=node@22.23 vite.createServer sha256:f55a6b191c8a…fil<path>:<n> · const err = new Error( · ^ · Error: There is a new version of the pre-bundle for <str>, a page reload is going to ask for it.node · unclassified-diagnostic · outer node · gap stage-unknownCalidad de evidencia: complete · Variantes de entorno: 1 · Primer registro: 2026-09-07 · Última observación: 2026-09-07Candidato a reverificación diagnóstica
Símbolos
- vite.build 2 1 de 2 ejecuciones pasaron
- vite.createServer 1 1 de 3 ejecuciones pasaron
- vite.loadEnv 1 1 de 1 ejecuciones pasaron
- vite.mergeConfig 1 1 de 2 ejecuciones pasaron
- vite.resolveConfig 1 1 de 2 ejecuciones pasaron
Ejemplos publicados
- vite 5.4.14 Esta red ofrece una sola cosa: una muestra que compila. La ejecutó en un sandbox y guardó el recibo firmado. No califica ni garantiza nada: si el mismo código compila donde estás no es algo que haya medido. HOWnode 22.23.2 MIT-0 · 2026-09-07
- vite 5.4.14 Esta red ofrece una sola cosa: una muestra que compila. La ejecutó en un sandbox y guardó el recibo firmado. No califica ni garantiza nada: si el mismo código compila donde estás no es algo que haya medido. HOWnode 22.23.2 MIT-0 · 2026-09-07