기록npmvite5.4.14
어떤 심볼이 어디서 돌아갔나
이 버전의 심볼 × 운영체제입니다. 셀을 클릭하면 패키지 호환성 큐브로 들어갑니다.
6 5○ 12026-09-17
| debian glibc | ubuntu glibc | |
|---|---|---|
| build | 100%2 | 100%1 |
| vite.build | 100%1 | 100%1 |
| vite.createServer | 100%1 | 100%4 |
| vite.loadEnv | 100%1 | 100%3 |
| vite.mergeConfig | 100%1 | 100%2 |
| vite.resolveConfig | 100%1 | 100%2 |
셀 읽는 법: 숫자는 비율이 딛고 선 기록된 관측 수입니다 — 한 번의 빌드가 도달한 단계마다 관측이 하나씩 남으므로, 빌드 수도 머신 수도 사람 수도 아닙니다. 옆의 문서는 출처가 다른 별개의 사실입니다: 그 좌표에 샘플이 있는지, 그리고 우리가 거기서 실행한 결과가 어떻는지입니다.
- 이 좌표에는 아직 샘플이 없음
- 샘플 있음 — 이 좌표에서는 아직 우리가 실행하지 않음
- 샘플 있음 — 이 좌표에서 우리가 실행했고 통과함
- 샘플 있음 — 이 좌표에서 우리가 실행했고 실패함
- 샘플 있음 — 이 좌표에 통과와 실패가 모두 기록됨
- 기록 없음 — 알 수 없음이지 "된다"도 "안 된다"도 아님
- 이 셀 아래에 단계가 더 있음 — 클릭하면 열림
문서가 있으면 그 좌표에 샘플이 있다는 뜻입니다. 샘플이 존재하는지는 이 버전과 이 API에 대한 사실이라 OS·런타임·패키지 매니저가 바뀌어도 달라지지 않고, 문서의 색은 지금 보고 있는 환경에서 그 샘플이 어떻게 실행됐는지를 말합니다.
환경 상세
프로젝트 수준 관측과 심벌/컨트랙트 검증은 따로 집계하며 절대 합산하지 않습니다.
이 수치는 심볼을 어떻게 호출했는지 구분하지 않습니다. 오버로드, 인자 형태, 옵션이 한데 묶여 집계됩니다. 특정 호출 형태가 어떻게 동작하는지는 이 숫자가 아니라 샘플의 계약이 증명합니다.
| 환경 | 신뢰도 | 관측 | 검증 | 통과율 | 피어 | 마지막 관측 |
|---|---|---|---|---|---|---|
| node 22 · JS · npm · linux glibc · docker
관측: PROJECT_LOAD 2✓ · PROJECT_TEST 2✓ — 사용: USED 2✓ — 검증: CONTRACT 4✓
|
LOW | 4 +2 | 4 | 100% | 1 · 1✓ | 2026-09-17 |
| node 22 · JS · npm · linux glibc · docker
관측: PROJECT_LOAD 2✓ · PROJECT_TEST 2✓ — 사용: USED 2✓ — 검증: CONTRACT 4✓
|
LOW | 4 +2 | 4 | 100% | 1 · 1✓ | 2026-09-17 |
| node 22.23 · JS · npm · linux glibc
관측: PROJECT_PROCESS 9✓ — 사용: USED 1✓ — 검증: UNKNOWN 0✓ 4✕
|
ELEVATED FAILURE | 9 +1 | 4 | 69% | 3 | 2026-09-07 |
| node 22.23 · JS · npm · linux glibc
관측: PROJECT_PROCESS 7✓ — 검증: UNKNOWN 0✓ 2✕
|
MEDIUM | 7 | 2 | 78% | 2 | 2026-09-07 |
최근 실패 클러스터
-
관측됨 UNKNOWN exit 1 ERR_MODULE_NOT_FOUND 증거 공백 ×3 5.4.14 → 7.3.6 executionContext=node · moduleSystem=cjs · os=linux · runtime=node@22.23 sha256:88af852f99a8…node:internal/modules/package_json_reader:<n> · throw new ERR_MODULE_NOT_FOUND(packageName, fileURLToPath(base), null); · ^ …node · unclassified-diagnostic · outer node · gap stage-unknown증거 품질: complete · 환경 변형: 1 · 최초 관측: 2026-09-07 · 마지막 관측: 2026-09-14진단 재검증 후보
-
관측됨 UNKNOWN exit 1 증거 공백 ×2 5.4.14 → 5.4.21 executionContext=node · moduleSystem=cjs · os=linux · runtime=node@22.23 vite.resolveConfig sha256:91ad26545eb1…node:internal/modules/cjs/loader:<n> · throw err; · ^ · Error: Cannot find module <str>node · unclassified-diagnostic · outer node · gap stage-unknown증거 품질: complete · 환경 변형: 1 · 최초 관측: 2026-08-31 · 마지막 관측: 2026-09-07진단 재검증 후보
-
관측됨 UNKNOWN exit 1 증거 공백 ×1 5.4.14 executionContext=node · moduleSystem=cjs · os=linux · runtime=node@22.23 vite.createServer sha256:148f04041544…atomic: true, · followSymlinks: true, · awaitWriteFinish: false · },node · unclassified-diagnostic · outer node · gap stage-unknown증거 품질: complete · 환경 변형: 1 · 최초 관측: 2026-09-07 · 마지막 관측: 2026-09-07진단 재검증 후보
-
관측됨 UNKNOWN exit 1 ERR_ASSERTION 증거 공백 ×1 5.4.14 executionContext=node · moduleSystem=esm · os=linux · runtime=node@22.23 vite.mergeConfig sha256:43caf7a060e7…node:internal/modules/run_main:<n> · triggerUncaughtException( · ^ · AssertionError [ERR_ASSERTION]: Expected values to be strictly deep-equal:node · unclassified-diagnostic · outer node · gap stage-unknown증거 품질: complete · 환경 변형: 1 · 최초 관측: 2026-09-07 · 마지막 관측: 2026-09-07진단 재검증 후보
-
관측됨 UNKNOWN exit 1 ERR_ASSERTION 증거 공백 ×1 5.4.14 executionContext=node · moduleSystem=esm · os=linux · runtime=node@22.23 vite.build sha256:a135683647c7…Test failed: AssertionError [ERR_ASSERTION]: Chunk should contain replaced define constant · at runTest (<url>) …node · unclassified-diagnostic · outer node · gap stage-unknown증거 품질: complete · 환경 변형: 1 · 최초 관측: 2026-09-07 · 마지막 관측: 2026-09-07진단 재검증 후보
-
관측됨 UNKNOWN exit 1 ERR_OUTDATED_OPTIMIZED_DEP 증거 공백 ×1 5.4.14 executionContext=node · moduleSystem=cjs · os=linux · runtime=node@22.23 vite.createServer sha256:f55a6b191c8a…fil<path>:<n> · const err = new Error( · ^ · Error: There is a new version of the pre-bundle for <str>, a page reload is going to ask for it.node · unclassified-diagnostic · outer node · gap stage-unknown증거 품질: complete · 환경 변형: 1 · 최초 관측: 2026-09-07 · 마지막 관측: 2026-09-07진단 재검증 후보
심벌
- vite.build 2 1/2회 통과
- vite.createServer 1 1/3회 통과
- vite.loadEnv 1 1/1회 통과
- vite.mergeConfig 1 1/2회 통과
- vite.resolveConfig 1 1/2회 통과
공개한 샘플
- vite 5.4.14 이 네트워크가 제공하는 것은 하나입니다. 빌드되는 샘플. 샌드박스에서 돌리고 서명된 영수증을 보관합니다. 등급을 매기지 않고 무엇도 보증하지 않습니다 — 같은 코드가 당신 환경에서 빌드되는지는 측정한 적이 없습니다. HOWnode 22.23.2 MIT-0 · 2026-09-07
- vite 5.4.14 이 네트워크가 제공하는 것은 하나입니다. 빌드되는 샘플. 샌드박스에서 돌리고 서명된 영수증을 보관합니다. 등급을 매기지 않고 무엇도 보증하지 않습니다 — 같은 코드가 당신 환경에서 빌드되는지는 측정한 적이 없습니다. HOWnode 22.23.2 MIT-0 · 2026-09-07