Aufzeichnungennpmvite5.4.14
Welches Symbol wo lief
Symbole × Betriebssysteme für diese Version. Zellen führen in den Kompatibilitätswürfel des Pakets.
| debian glibc | ubuntu glibc | |
|---|---|---|
| build | 100%2 | 100%1 |
| vite.build | 100%1 | 100%1 |
| vite.createServer | 100%1 | 100%4 |
| vite.loadEnv | 100%1 | 100%3 |
| vite.mergeConfig | 100%1 | 100%2 |
| vite.resolveConfig | 100%1 | 100%2 |
Eine Zelle lesen: Die Zahl sind die aufgezeichneten Beobachtungen, durch die die Rate teilt — ein Build hinterlässt pro erreichter Stufe eine Beobachtung, also zählt sie weder Builds noch Maschinen noch Personen. Das Dokument daneben ist eine andere Tatsache aus einer anderen Quelle: ob an dieser Koordinate ein Sample existiert und wie unser eigener Lauf davon dort ausging.
- an dieser Koordinate noch kein Sample
- hier gibt es ein Sample, und wir haben es an dieser Koordinate noch nicht ausgeführt
- hier gibt es ein Sample, und unser Lauf an dieser Koordinate kam sauber zurück
- hier gibt es ein Sample, und unser Lauf an dieser Koordinate ist fehlgeschlagen
- hier gibt es ein Sample, und an dieser Koordinate sind ein bestandener und ein fehlgeschlagener Lauf verzeichnet
- nichts aufgezeichnet — unbekannt, weder „funktioniert“ noch „defekt“
- unter dieser Zelle liegt eine Ebene — zum Öffnen klicken
Ein Dokument bedeutet: An dieser Koordinate gibt es ein Sample. DASS es existiert, ist eine Aussage über diese Version und diese API und ändert sich nicht mit Betriebssystem, Runtime oder Paketmanager; seine FARBE sagt, wie dieses Sample in der Umgebung gelaufen ist, die Sie gerade ansehen.
Umgebungsdetails
Beobachtungen auf Projektebene und Symbol-/Contract-Verifizierungen werden getrennt gezählt und niemals zusammengerechnet.
Diese Zahlen unterscheiden nicht, wie das Symbol aufgerufen wurde: Überladungen, Argumentformen und Optionen werden zusammengefasst. Was eine bestimmte Aufrufform tut, beweist der Vertrag eines Samples – nicht diese Zahlen.
| Umgebung | Konfidenz | Beobachtungen | Verifiziert | Erfolgsquote | Peers | Zuletzt gesehen |
|---|---|---|---|---|---|---|
| node 22 · JS · npm · linux glibc · docker
Beobachtungen: PROJECT_LOAD 2✓ · PROJECT_TEST 2✓ — Nutzung: USED 2✓ — Verifiziert: CONTRACT 4✓
|
LOW | 4 +2 | 4 | 100 % | 1 · 1✓ | 2026-09-17 |
| node 22 · JS · npm · linux glibc · docker
Beobachtungen: PROJECT_LOAD 2✓ · PROJECT_TEST 2✓ — Nutzung: USED 2✓ — Verifiziert: CONTRACT 4✓
|
LOW | 4 +2 | 4 | 100 % | 1 · 1✓ | 2026-09-17 |
| node 22.23 · JS · npm · linux glibc
Beobachtungen: PROJECT_PROCESS 9✓ — Nutzung: USED 1✓ — Verifiziert: UNKNOWN 0✓ 4✕
|
ELEVATED FAILURE | 9 +1 | 4 | 69 % | 3 | 2026-09-07 |
| node 22.23 · JS · npm · linux glibc
Beobachtungen: PROJECT_PROCESS 7✓ — Verifiziert: UNKNOWN 0✓ 2✕
|
MEDIUM | 7 | 2 | 78 % | 2 | 2026-09-07 |
Aktuelle Fehler-Cluster
-
beobachtet UNKNOWN exit 1 ERR_MODULE_NOT_FOUND Beweislücke ×3 5.4.14 → 7.3.6 executionContext=node · moduleSystem=cjs · os=linux · runtime=node@22.23 sha256:88af852f99a8…node:internal/modules/package_json_reader:<n> · throw new ERR_MODULE_NOT_FOUND(packageName, fileURLToPath(base), null); · ^ …node · unclassified-diagnostic · outer node · gap stage-unknownBeweisqualität: complete · Umgebungsvarianten: 1 · Zuerst erfasst: 2026-09-07 · Zuletzt gesehen: 2026-09-14Kandidat für diagnostische Neuprüfung
-
beobachtet UNKNOWN exit 1 Beweislücke ×2 5.4.14 → 5.4.21 executionContext=node · moduleSystem=cjs · os=linux · runtime=node@22.23 vite.resolveConfig sha256:91ad26545eb1…node:internal/modules/cjs/loader:<n> · throw err; · ^ · Error: Cannot find module <str>node · unclassified-diagnostic · outer node · gap stage-unknownBeweisqualität: complete · Umgebungsvarianten: 1 · Zuerst erfasst: 2026-08-31 · Zuletzt gesehen: 2026-09-07Kandidat für diagnostische Neuprüfung
-
beobachtet UNKNOWN exit 1 Beweislücke ×1 5.4.14 executionContext=node · moduleSystem=cjs · os=linux · runtime=node@22.23 vite.createServer sha256:148f04041544…atomic: true, · followSymlinks: true, · awaitWriteFinish: false · },node · unclassified-diagnostic · outer node · gap stage-unknownBeweisqualität: complete · Umgebungsvarianten: 1 · Zuerst erfasst: 2026-09-07 · Zuletzt gesehen: 2026-09-07Kandidat für diagnostische Neuprüfung
-
beobachtet UNKNOWN exit 1 ERR_ASSERTION Beweislücke ×1 5.4.14 executionContext=node · moduleSystem=esm · os=linux · runtime=node@22.23 vite.mergeConfig sha256:43caf7a060e7…node:internal/modules/run_main:<n> · triggerUncaughtException( · ^ · AssertionError [ERR_ASSERTION]: Expected values to be strictly deep-equal:node · unclassified-diagnostic · outer node · gap stage-unknownBeweisqualität: complete · Umgebungsvarianten: 1 · Zuerst erfasst: 2026-09-07 · Zuletzt gesehen: 2026-09-07Kandidat für diagnostische Neuprüfung
-
beobachtet UNKNOWN exit 1 ERR_ASSERTION Beweislücke ×1 5.4.14 executionContext=node · moduleSystem=esm · os=linux · runtime=node@22.23 vite.build sha256:a135683647c7…Test failed: AssertionError [ERR_ASSERTION]: Chunk should contain replaced define constant · at runTest (<url>) …node · unclassified-diagnostic · outer node · gap stage-unknownBeweisqualität: complete · Umgebungsvarianten: 1 · Zuerst erfasst: 2026-09-07 · Zuletzt gesehen: 2026-09-07Kandidat für diagnostische Neuprüfung
-
beobachtet UNKNOWN exit 1 ERR_OUTDATED_OPTIMIZED_DEP Beweislücke ×1 5.4.14 executionContext=node · moduleSystem=cjs · os=linux · runtime=node@22.23 vite.createServer sha256:f55a6b191c8a…fil<path>:<n> · const err = new Error( · ^ · Error: There is a new version of the pre-bundle for <str>, a page reload is going to ask for it.node · unclassified-diagnostic · outer node · gap stage-unknownBeweisqualität: complete · Umgebungsvarianten: 1 · Zuerst erfasst: 2026-09-07 · Zuletzt gesehen: 2026-09-07Kandidat für diagnostische Neuprüfung
Symbole
- vite.build 2 1 von 2 Läufen bestanden
- vite.createServer 1 1 von 3 Läufen bestanden
- vite.loadEnv 1 1 von 1 Läufen bestanden
- vite.mergeConfig 1 1 von 2 Läufen bestanden
- vite.resolveConfig 1 1 von 2 Läufen bestanden
Veröffentlichte Beispiele
- vite 5.4.14 Dieses Netzwerk bietet eine Sache: ein Sample, das baut. Es hat es in einer Sandbox ausgeführt und die signierte Quittung behalten. Es bewertet nichts und garantiert nichts — ob derselbe Code bei Ihnen baut, hat es nicht gemessen. HOWnode 22.23.2 MIT-0 · 2026-09-07
- vite 5.4.14 Dieses Netzwerk bietet eine Sache: ein Sample, das baut. Es hat es in einer Sandbox ausgeführt und die signierte Quittung behalten. Es bewertet nichts und garantiert nichts — ob derselbe Code bei Ihnen baut, hat es nicht gemessen. HOWnode 22.23.2 MIT-0 · 2026-09-07