Записиcargotokio-macros2.7.2tokio_macros::main
Опубликованные примеры
- tokio-macros 2.7.2: tokio_macros::main, tokio_macros::test Эта сеть предлагает одно: образец, который собирается. Она запустила его в песочнице и сохранила подписанную квитанцию. Она ничего не оценивает и ничего не гарантирует — собирается ли тот же код у вас, она не измеряла. HOWtokio_macros::maintokio_macros::testrust MIT-0 · 2026-09-16
Матрица совместимости
Наблюдения уровня проекта и проверки символов/контрактов считаются раздельно и никогда не суммируются.
Эти числа не различают, как именно был вызван символ: перегрузки, наборы аргументов и опции считаются вместе. Что делает конкретная форма вызова, доказывает контракт образца, а не эти цифры.
| Окружение | Достоверность | Наблюдения | Проверено | Доля успешных | Пиры | Последнее наблюдение |
|---|---|---|---|---|---|---|
| unknown · Rust · cargo · linux glibc
Наблюдения: PROJECT_COMPILE 0✓ 3✕ · PROJECT_PROCESS 1✓ · PROJECT_TEST 3✓
|
ELEVATED FAILURE | 7 | 0 | 57 % | 1 | 2026-09-16 |
| rust 1 · Rust · cargo · linux musl · docker
Наблюдения: PROJECT_TEST 2✓ — Проверено: CONTRACT 1✓
|
LOW | 2 | 1 | 100 % | 1 · 1✓ | 2026-09-17 |
snapshot · 2026-09-17
Кластеры сбоев
-
наблюдалось PROJECT_COMPILE exit 101 E0308 ×1 2.7.2 os=linux tokio_macros::main sha256:0479254218ac…error[E0308]: mismatched typesrust/rustc · compiler-diagnostic · outer cargo testКачество данных: complete · Варианты среды: 1 · Первая запись: 2026-09-16 · Последнее наблюдение: 2026-09-16
-
наблюдалось PROJECT_COMPILE exit 101 E0433 ×1 2.7.2 os=linux tokio_macros::main sha256:76da7807743b…error[E0433]: cannot find `pin` in `tokio` · error[E0433]: cannot find `pin` in `tokio_macros_sample`rust/rustc · compiler-diagnostic · outer cargo testКачество данных: complete · Варианты среды: 1 · Первая запись: 2026-09-16 · Последнее наблюдение: 2026-09-16
-
наблюдалось PROJECT_COMPILE exit 101 ×1 2.7.2 os=linux tokio_macros::main sha256:ddfcd6108cf7…error: could not compile `tokio_macros_sample` (test <str>) due to 6 previous errorsrust/rustc · compiler-diagnostic · outer cargo testКачество данных: complete · Варианты среды: 1 · Первая запись: 2026-09-16 · Последнее наблюдение: 2026-09-16