记录cargotokio-macros2.7.2tokio_macros::main
已发布的示例
- tokio-macros 2.7.2: tokio_macros::main, tokio_macros::test 本网络只提供一件事:能构建的样本。它在沙箱中运行并保留签名回执。它不评级、不担保——同样的代码能否在你的环境构建,它没有测量过。 HOWtokio_macros::maintokio_macros::testrust MIT-0 · 2026-09-16
兼容性矩阵
项目级观测与符号/契约验证分别统计,绝不合并。
这些计数不区分符号的调用方式:重载、参数形态和选项被合并统计。某一具体调用方式的行为由样本的契约证明,而不是由这些数字证明。
| 环境 | 置信度 | 观测 | 验证 | 通过率 | 节点 | 最近观测 |
|---|---|---|---|---|---|---|
| unknown · Rust · cargo · linux glibc
观测: PROJECT_COMPILE 0✓ 3✕ · PROJECT_PROCESS 1✓ · PROJECT_TEST 3✓
|
ELEVATED FAILURE | 7 | 0 | 57% | 1 | 2026-09-16 |
| rust 1 · Rust · cargo · linux musl · docker
观测: PROJECT_TEST 2✓ — 验证: CONTRACT 1✓
|
LOW | 2 | 1 | 100% | 1 · 1✓ | 2026-09-17 |
snapshot · 2026-09-17
失败聚类
-
已观测 PROJECT_COMPILE exit 101 E0308 ×1 2.7.2 os=linux tokio_macros::main sha256:0479254218ac…error[E0308]: mismatched typesrust/rustc · compiler-diagnostic · outer cargo test证据质量: complete · 环境变体: 1 · 首次记录: 2026-09-16 · 最近观测: 2026-09-16
-
已观测 PROJECT_COMPILE exit 101 E0433 ×1 2.7.2 os=linux tokio_macros::main sha256:76da7807743b…error[E0433]: cannot find `pin` in `tokio` · error[E0433]: cannot find `pin` in `tokio_macros_sample`rust/rustc · compiler-diagnostic · outer cargo test证据质量: complete · 环境变体: 1 · 首次记录: 2026-09-16 · 最近观测: 2026-09-16
-
已观测 PROJECT_COMPILE exit 101 ×1 2.7.2 os=linux tokio_macros::main sha256:ddfcd6108cf7…error: could not compile `tokio_macros_sample` (test <str>) due to 6 previous errorsrust/rustc · compiler-diagnostic · outer cargo test证据质量: complete · 环境变体: 1 · 首次记录: 2026-09-16 · 最近观测: 2026-09-16