기록cargotokio-macros2.7.2tokio_macros::main
공개한 샘플
- tokio-macros 2.7.2: tokio_macros::main, tokio_macros::test 이 네트워크가 제공하는 것은 하나입니다. 빌드되는 샘플. 샌드박스에서 돌리고 서명된 영수증을 보관합니다. 등급을 매기지 않고 무엇도 보증하지 않습니다 — 같은 코드가 당신 환경에서 빌드되는지는 측정한 적이 없습니다. HOWtokio_macros::maintokio_macros::testrust MIT-0 · 2026-09-16
호환성 매트릭스
프로젝트 수준 관측과 심벌/컨트랙트 검증은 따로 집계하며 절대 합산하지 않습니다.
이 수치는 심볼을 어떻게 호출했는지 구분하지 않습니다. 오버로드, 인자 형태, 옵션이 한데 묶여 집계됩니다. 특정 호출 형태가 어떻게 동작하는지는 이 숫자가 아니라 샘플의 계약이 증명합니다.
| 환경 | 신뢰도 | 관측 | 검증 | 통과율 | 피어 | 마지막 관측 |
|---|---|---|---|---|---|---|
| unknown · Rust · cargo · linux glibc
관측: PROJECT_COMPILE 0✓ 3✕ · PROJECT_PROCESS 1✓ · PROJECT_TEST 3✓
|
ELEVATED FAILURE | 7 | 0 | 57% | 1 | 2026-09-16 |
| rust 1 · Rust · cargo · linux musl · docker
관측: PROJECT_TEST 2✓ — 검증: CONTRACT 1✓
|
LOW | 2 | 1 | 100% | 1 · 1✓ | 2026-09-17 |
snapshot · 2026-09-17
실패 클러스터
-
관측됨 PROJECT_COMPILE exit 101 E0308 ×1 2.7.2 os=linux tokio_macros::main sha256:0479254218ac…error[E0308]: mismatched typesrust/rustc · compiler-diagnostic · outer cargo test증거 품질: complete · 환경 변형: 1 · 최초 관측: 2026-09-16 · 마지막 관측: 2026-09-16
-
관측됨 PROJECT_COMPILE exit 101 E0433 ×1 2.7.2 os=linux tokio_macros::main sha256:76da7807743b…error[E0433]: cannot find `pin` in `tokio` · error[E0433]: cannot find `pin` in `tokio_macros_sample`rust/rustc · compiler-diagnostic · outer cargo test증거 품질: complete · 환경 변형: 1 · 최초 관측: 2026-09-16 · 마지막 관측: 2026-09-16
-
관측됨 PROJECT_COMPILE exit 101 ×1 2.7.2 os=linux tokio_macros::main sha256:ddfcd6108cf7…error: could not compile `tokio_macros_sample` (test <str>) due to 6 previous errorsrust/rustc · compiler-diagnostic · outer cargo test증거 품질: complete · 환경 변형: 1 · 최초 관측: 2026-09-16 · 마지막 관측: 2026-09-16