Записиcargotokio-macros2.7.2
Какой символ где выполнялся
Символы × операционные системы для этой версии. Ячейки ведут в куб совместимости пакета.
Как читать ячейку: Число — это записанные наблюдения, на которые делится доля: одна сборка оставляет по наблюдению на каждый достигнутый этап, поэтому это не число сборок, не число машин и не число людей. Документ рядом — другой факт из другого источника: есть ли в этой координате образец и чем закончился наш запуск его там.
- в этой координате образца пока нет
- образец есть — в этой координате мы его ещё не запускали
- образец есть — наш запуск в этой координате завершился чисто
- образец есть — наш запуск в этой координате не прошёл
- образец есть — в этой координате записаны и успешный, и неуспешный запуск
- ничего не записано — неизвестно, а не «работает» и не «сломано»
- под этой ячейкой есть уровень — нажмите, чтобы открыть
Документ означает, что в этой координате есть образец. Его НАЛИЧИЕ — это факт об этой версии и этом API, оно не меняется от ОС, среды выполнения или пакетного менеджера; ЦВЕТ говорит, как этот образец отработал в том окружении, которое вы сейчас смотрите.
Детали окружения
Наблюдения уровня проекта и проверки символов/контрактов считаются раздельно и никогда не суммируются.
Эти числа не различают, как именно был вызван символ: перегрузки, наборы аргументов и опции считаются вместе. Что делает конкретная форма вызова, доказывает контракт образца, а не эти цифры.
| Окружение | Достоверность | Наблюдения | Проверено | Доля успешных | Пиры | Последнее наблюдение |
|---|---|---|---|---|---|---|
| unknown · Rust · cargo · linux glibc
Наблюдения: PROJECT_COMPILE 0✓ 3✕ · PROJECT_PROCESS 1✓ · PROJECT_TEST 3✓
|
ELEVATED FAILURE | 7 | 0 | 57 % | 1 | 2026-09-16 |
| rust 1 · Rust · cargo · linux musl · docker
Наблюдения: PROJECT_LOAD 2✓ · PROJECT_TEST 2✓ — Использование: USED 3✓ — Проверено: CONTRACT 1✓
|
LOW | 4 +3 | 1 | 100 % | 1 · 1✓ | 2026-09-17 |
Недавние кластеры сбоев
-
наблюдалось PROJECT_COMPILE exit 101 E0308 ×1 2.7.2 os=linux tokio_macros::main sha256:0479254218ac…error[E0308]: mismatched typesrust/rustc · compiler-diagnostic · outer cargo testКачество данных: complete · Варианты среды: 1 · Первая запись: 2026-09-16 · Последнее наблюдение: 2026-09-16
-
наблюдалось PROJECT_COMPILE exit 101 E0433 ×1 2.7.2 os=linux tokio_macros::main sha256:76da7807743b…error[E0433]: cannot find `pin` in `tokio` · error[E0433]: cannot find `pin` in `tokio_macros_sample`rust/rustc · compiler-diagnostic · outer cargo testКачество данных: complete · Варианты среды: 1 · Первая запись: 2026-09-16 · Последнее наблюдение: 2026-09-16
-
наблюдалось PROJECT_COMPILE exit 101 ×1 2.7.2 os=linux tokio_macros::main sha256:ddfcd6108cf7…error: could not compile `tokio_macros_sample` (test <str>) due to 6 previous errorsrust/rustc · compiler-diagnostic · outer cargo testКачество данных: complete · Варианты среды: 1 · Первая запись: 2026-09-16 · Последнее наблюдение: 2026-09-16
Символы
- tokio_macros::main 1 пройдено 1 из 1 запусков
- tokio_macros::test 1 пройдено 1 из 1 запусков