Registroscargotokio-macros2.7.2
Qué símbolo se ejecutó dónde
Símbolos × sistemas operativos para esta versión. Las celdas llevan al cubo de compatibilidad del paquete.
Cómo leer una celda: El número son las observaciones registradas entre las que divide la tasa: una compilación deja una observación por cada etapa que alcanzó, así que no cuenta compilaciones, ni máquinas, ni personas. El documento de al lado es otro hecho de otra fuente: si hay una muestra en esa coordenada y cómo fue nuestra ejecución de ella allí.
- todavía no hay muestra en esta coordenada
- hay una muestra aquí y todavía no la hemos ejecutado en esta coordenada
- hay una muestra aquí y nuestra ejecución en esta coordenada terminó limpia
- hay una muestra aquí y nuestra ejecución en esta coordenada falló
- hay una muestra aquí y esta coordenada registra a la vez una ejecución con éxito y otra con fallo
- nada registrado — desconocido, ni «funciona» ni «roto»
- hay un nivel bajo esta celda: haz clic para abrirlo
Un documento significa que hay una muestra en esa coordenada. Que EXISTA es un hecho sobre esta versión y esta API y no cambia con el sistema operativo, el runtime ni el gestor de paquetes; su COLOR es cómo se ejecutó esa muestra en el entorno que estás mirando.
Detalle del entorno
Las observaciones a nivel de proyecto y las verificaciones de símbolo/contrato se cuentan por separado y nunca se combinan.
Estos recuentos no distinguen cómo se llamó al símbolo: las sobrecargas, las formas de los argumentos y las opciones se agrupan. Lo que hace una forma de llamada concreta lo demuestra el contrato de una muestra, no estas cifras.
| Entorno | Confianza | Observaciones | Verificado | Tasa de éxito | Pares | Última observación |
|---|---|---|---|---|---|---|
| unknown · Rust · cargo · linux glibc
Observaciones: PROJECT_COMPILE 0✓ 3✕ · PROJECT_PROCESS 1✓ · PROJECT_TEST 3✓
|
ELEVATED FAILURE | 7 | 0 | 57% | 1 | 2026-09-16 |
| rust 1 · Rust · cargo · linux musl · docker
Observaciones: PROJECT_LOAD 2✓ · PROJECT_TEST 2✓ — Uso: USED 3✓ — Verificado: CONTRACT 1✓
|
LOW | 4 +3 | 1 | 100% | 1 · 1✓ | 2026-09-17 |
Clústeres de fallos recientes
-
observado PROJECT_COMPILE exit 101 E0308 ×1 2.7.2 os=linux tokio_macros::main sha256:0479254218ac…error[E0308]: mismatched typesrust/rustc · compiler-diagnostic · outer cargo testCalidad de evidencia: complete · Variantes de entorno: 1 · Primer registro: 2026-09-16 · Última observación: 2026-09-16
-
observado PROJECT_COMPILE exit 101 E0433 ×1 2.7.2 os=linux tokio_macros::main sha256:76da7807743b…error[E0433]: cannot find `pin` in `tokio` · error[E0433]: cannot find `pin` in `tokio_macros_sample`rust/rustc · compiler-diagnostic · outer cargo testCalidad de evidencia: complete · Variantes de entorno: 1 · Primer registro: 2026-09-16 · Última observación: 2026-09-16
-
observado PROJECT_COMPILE exit 101 ×1 2.7.2 os=linux tokio_macros::main sha256:ddfcd6108cf7…error: could not compile `tokio_macros_sample` (test <str>) due to 6 previous errorsrust/rustc · compiler-diagnostic · outer cargo testCalidad de evidencia: complete · Variantes de entorno: 1 · Primer registro: 2026-09-16 · Última observación: 2026-09-16
Símbolos
- tokio_macros::main 1 1 de 1 ejecuciones pasaron
- tokio_macros::test 1 1 de 1 ejecuciones pasaron