Записиnpmlightningcss1.33.0bundle
OS × среда выполнения одним взглядом
Как читать ячейку: Число — это записанные наблюдения, на которые делится доля: одна сборка оставляет по наблюдению на каждый достигнутый этап, поэтому это не число сборок, не число машин и не число людей. Документ рядом — другой факт из другого источника: есть ли в этой координате образец и чем закончился наш запуск его там.
- в этой координате образца пока нет
- образец есть — в этой координате мы его ещё не запускали
- образец есть — наш запуск в этой координате завершился чисто
- образец есть — наш запуск в этой координате не прошёл
- образец есть — в этой координате записаны и успешный, и неуспешный запуск
- ничего не записано — неизвестно, а не «работает» и не «сломано»
- под этой ячейкой есть уровень — нажмите, чтобы открыть
Документ означает, что в этой координате есть образец. Его НАЛИЧИЕ — это факт об этой версии и этом API, оно не меняется от ОС, среды выполнения или пакетного менеджера; ЦВЕТ говорит, как этот образец отработал в том окружении, которое вы сейчас смотрите.
Опубликованные примеры
- lightningcss 1.33.0: bundle Эта сеть предлагает одно: образец, который собирается. Она запустила его в песочнице и сохранила подписанную квитанцию. Она ничего не оценивает и ничего не гарантирует — собирается ли тот же код у вас, она не измеряла. HOWbundlenode 22.23.2 MIT-0 · 2026-09-02
- lightningcss 1.33.0: bundle Эта сеть предлагает одно: образец, который собирается. Она запустила его в песочнице и сохранила подписанную квитанцию. Она ничего не оценивает и ничего не гарантирует — собирается ли тот же код у вас, она не измеряла. HOWlightningcss.bundlenode 22.23.2 MIT-0 · 2026-09-05
Матрица совместимости
Наблюдения уровня проекта и проверки символов/контрактов считаются раздельно и никогда не суммируются.
Эти числа не различают, как именно был вызван символ: перегрузки, наборы аргументов и опции считаются вместе. Что делает конкретная форма вызова, доказывает контракт образца, а не эти цифры.
| Окружение | Достоверность | Наблюдения | Проверено | Доля успешных | Пиры | Последнее наблюдение |
|---|---|---|---|---|---|---|
| node 22 · JS · npm · linux glibc · docker
Наблюдения: PROJECT_TEST 1✓ — Проверено: CONTRACT 1✓
|
LOW | 1 | 1 | 100 % | 1 · 1✓ | 2026-09-14 |
| node 22 · JS · npm · linux glibc · docker
Наблюдения: PROJECT_TEST 1✓
|
LOW | 1 | 0 | 100 % | 1 | 2026-09-17 |
| node 22.23 · JS · npm · linux glibc
Наблюдения: PROJECT_PROCESS 1✓
|
LOW | 1 | 0 | 100 % | 1 | 2026-09-02 |
| node 22.23 · JS · npm · linux glibc
Наблюдения: PROJECT_PROCESS 1✓
|
LOW | 1 | 0 | 100 % | 1 | 2026-09-05 |
snapshot · 2026-09-17
Кластеры сбоев
-
наблюдалось PROJECT_PROCESS ERR_MODULE_NOT_FOUND Пробел в данных ×3 1.33.0 executionContext=node · moduleSystem=esm · os=windows · runtime=node@24.13Качество данных: legacy-evidence-incomplete · Варианты среды: 1 · Первая запись: 2026-08-14 · Последнее наблюдение: 2026-08-14Кандидат на диагностическую перепроверку
-
наблюдалось UNKNOWN exit 1 ERR_ASSERTION Пробел в данных ×2 1.33.0 executionContext=node · moduleSystem=esm · os=windows · runtime=node@24.13 sha256:340c5f78ca35…Image hunterzo-egress-lab:local Building · Image hunterzo-egress-lab:local Built · Network hunterzo-egress-lab_fixture_net Creating …· unclassified-diagnostic · gap stage-unknownКачество данных: complete · Варианты среды: 1 · Первая запись: 2026-09-14 · Последнее наблюдение: 2026-09-14Кандидат на диагностическую перепроверку
-
наблюдалось PROJECT_TEST exit 1 ERR_LOAD_URL ×1 1.33.0 executionContext=node · moduleSystem=esm · os=linux · runtime=node@22.23 sha256:a60e7101af87…Contract test failed: Error: Failed to load custom Reporter from basic · at loadCustomReporterModule (fil<path>:<n>:<n>) · at fil<path>:<n>:<n> …javascript/test-runner · test-runner-diagnostic · outer npm testКачество данных: complete · Варианты среды: 1 · Первая запись: 2026-08-31 · Последнее наблюдение: 2026-08-31
-
наблюдалось UNKNOWN exit 1 Пробел в данных ×1 1.33.0 executionContext=node · moduleSystem=esm · os=linux · runtime=node@22.23 sha256:0ce61af3f1a8…<url>]:<n> · const res = await babelPlugin.transform.handler(code, <str>); · ^ · TypeError: Cannot read properties of undefined (reading <str>)node · unclassified-diagnostic · outer node · gap stage-unknownКачество данных: complete · Варианты среды: 1 · Первая запись: 2026-09-01 · Последнее наблюдение: 2026-09-01Кандидат на диагностическую перепроверку
-
наблюдалось UNKNOWN exit 1 Пробел в данных ×1 1.33.0 executionContext=node · moduleSystem=esm · os=linux · runtime=node@22.23 sha256:249ecd4b894f…fil<path>:<n> · skipFastRefresh = isProduction || config.command === <str> || config.server.hmr === false; · ^ …node · unclassified-diagnostic · outer node · gap stage-unknownКачество данных: complete · Варианты среды: 1 · Первая запись: 2026-09-01 · Последнее наблюдение: 2026-09-01Кандидат на диагностическую перепроверку
-
наблюдалось UNKNOWN exit 1 Пробел в данных ×1 1.33.0 executionContext=node · moduleSystem=esm · os=linux · runtime=node@22.23 sha256:8a6df6b44383…fil<path>:<n> · if (config.experimental.bundledDev) isBundledDev = true; · ^ · TypeError: Cannot read properties of undefined (reading <str>)node · unclassified-diagnostic · outer node · gap stage-unknownКачество данных: complete · Варианты среды: 1 · Первая запись: 2026-09-01 · Последнее наблюдение: 2026-09-01Кандидат на диагностическую перепроверку
-
наблюдалось UNKNOWN exit 1 ERR_ASSERTION Пробел в данных ×1 1.33.0 executionContext=node · moduleSystem=esm · os=linux · runtime=node@22.23 sha256:8b0e67a45c04…node:internal/modules/run_main:<n> · triggerUncaughtException( · ^ · AssertionError [ERR_ASSERTION]: resolves <path> to virtual module IDnode · unclassified-diagnostic · outer node · gap stage-unknownКачество данных: complete · Варианты среды: 1 · Первая запись: 2026-09-01 · Последнее наблюдение: 2026-09-01Кандидат на диагностическую перепроверку
-
наблюдалось UNKNOWN exit 1 ERR_ASSERTION Пробел в данных ×1 1.33.0 executionContext=node · moduleSystem=esm · os=linux · runtime=node@22.23 sha256:9088da2c451a…node:internal/modules/run_main:<n> · triggerUncaughtException( · ^ · AssertionError [ERR_ASSERTION]: load code contains RefreshRuntimenode · unclassified-diagnostic · outer node · gap stage-unknownКачество данных: complete · Варианты среды: 1 · Первая запись: 2026-09-01 · Последнее наблюдение: 2026-09-01Кандидат на диагностическую перепроверку
-
наблюдалось UNKNOWN exit 1 Пробел в данных ×1 1.33.0 executionContext=node · moduleSystem=esm · os=linux · runtime=node@22.23 sha256:aaa882de0091…fil<path>:<n> · const hooks = config.plugins.map((plugin) => plugin.api?.reactBabel).filter(defined); · ^ …node · unclassified-diagnostic · outer node · gap stage-unknownКачество данных: complete · Варианты среды: 1 · Первая запись: 2026-09-01 · Последнее наблюдение: 2026-09-01Кандидат на диагностическую перепроверку
-
наблюдалось UNKNOWN exit 1 ERR_PACKAGE_PATH_NOT_EXPORTED Пробел в данных ×1 1.33.0 executionContext=node · moduleSystem=esm · os=linux · runtime=node@22.23 sha256:b9a7518ba7bb…node:internal/modules/esm/resolve:<n> · return new ERR_PACKAGE_PATH_NOT_EXPORTED( · ^ …node · unclassified-diagnostic · outer node · gap stage-unknownКачество данных: complete · Варианты среды: 1 · Первая запись: 2026-09-01 · Последнее наблюдение: 2026-09-01Кандидат на диагностическую перепроверку
-
наблюдалось UNKNOWN exit 1 ERR_ASSERTION Пробел в данных ×1 1.33.0 executionContext=node · moduleSystem=cjs · os=linux · runtime=node@22.23 sha256:986d98189e70…node:internal/modules/run_main:<n> · triggerUncaughtException( · ^ · AssertionError [ERR_ASSERTION]: Expected values to be strictly equal:node · unclassified-diagnostic · outer node · gap stage-unknownКачество данных: complete · Варианты среды: 1 · Первая запись: 2026-09-04 · Последнее наблюдение: 2026-09-04Кандидат на диагностическую перепроверку
-
наблюдалось UNKNOWN exit 1 ERR_PACKAGE_PATH_NOT_EXPORTED Пробел в данных ×1 1.33.0 executionContext=node · moduleSystem=cjs · os=linux · runtime=node@22.23 sha256:e72340c7e3d4…node:internal/modules/cjs/loader:<n> · throw e; · ^ · Error [ERR_PACKAGE_PATH_NOT_EXPORTED]: Package subpath <str> is not defined by <str> in <path>node · unclassified-diagnostic · outer node · gap stage-unknownКачество данных: complete · Варианты среды: 1 · Первая запись: 2026-09-04 · Последнее наблюдение: 2026-09-04Кандидат на диагностическую перепроверку
Показаны 12 наиболее часто сообщаемых из 43 записанных кластеров отказов. Остальные — единичные сообщения.