기록npmlightningcss1.33.0bundle
OS × 런타임 한눈에 보기
1○ 12026-09-17
셀 읽는 법: 숫자는 비율이 딛고 선 기록된 관측 수입니다 — 한 번의 빌드가 도달한 단계마다 관측이 하나씩 남으므로, 빌드 수도 머신 수도 사람 수도 아닙니다. 옆의 문서는 출처가 다른 별개의 사실입니다: 그 좌표에 샘플이 있는지, 그리고 우리가 거기서 실행한 결과가 어떻는지입니다.
- 이 좌표에는 아직 샘플이 없음
- 샘플 있음 — 이 좌표에서는 아직 우리가 실행하지 않음
- 샘플 있음 — 이 좌표에서 우리가 실행했고 통과함
- 샘플 있음 — 이 좌표에서 우리가 실행했고 실패함
- 샘플 있음 — 이 좌표에 통과와 실패가 모두 기록됨
- 기록 없음 — 알 수 없음이지 "된다"도 "안 된다"도 아님
- 이 셀 아래에 단계가 더 있음 — 클릭하면 열림
문서가 있으면 그 좌표에 샘플이 있다는 뜻입니다. 샘플이 존재하는지는 이 버전과 이 API에 대한 사실이라 OS·런타임·패키지 매니저가 바뀌어도 달라지지 않고, 문서의 색은 지금 보고 있는 환경에서 그 샘플이 어떻게 실행됐는지를 말합니다.
공개한 샘플
- lightningcss 1.33.0: bundle 이 네트워크가 제공하는 것은 하나입니다. 빌드되는 샘플. 샌드박스에서 돌리고 서명된 영수증을 보관합니다. 등급을 매기지 않고 무엇도 보증하지 않습니다 — 같은 코드가 당신 환경에서 빌드되는지는 측정한 적이 없습니다. HOWbundlenode 22.23.2 MIT-0 · 2026-09-02
- lightningcss 1.33.0: bundle 이 네트워크가 제공하는 것은 하나입니다. 빌드되는 샘플. 샌드박스에서 돌리고 서명된 영수증을 보관합니다. 등급을 매기지 않고 무엇도 보증하지 않습니다 — 같은 코드가 당신 환경에서 빌드되는지는 측정한 적이 없습니다. HOWlightningcss.bundlenode 22.23.2 MIT-0 · 2026-09-05
호환성 매트릭스
프로젝트 수준 관측과 심벌/컨트랙트 검증은 따로 집계하며 절대 합산하지 않습니다.
이 수치는 심볼을 어떻게 호출했는지 구분하지 않습니다. 오버로드, 인자 형태, 옵션이 한데 묶여 집계됩니다. 특정 호출 형태가 어떻게 동작하는지는 이 숫자가 아니라 샘플의 계약이 증명합니다.
| 환경 | 신뢰도 | 관측 | 검증 | 통과율 | 피어 | 마지막 관측 |
|---|---|---|---|---|---|---|
| node 22 · JS · npm · linux glibc · docker
관측: PROJECT_TEST 1✓ — 검증: CONTRACT 1✓
|
LOW | 1 | 1 | 100% | 1 · 1✓ | 2026-09-14 |
| node 22 · JS · npm · linux glibc · docker
관측: PROJECT_TEST 1✓
|
LOW | 1 | 0 | 100% | 1 | 2026-09-17 |
| node 22.23 · JS · npm · linux glibc
관측: PROJECT_PROCESS 1✓
|
LOW | 1 | 0 | 100% | 1 | 2026-09-02 |
| node 22.23 · JS · npm · linux glibc
관측: PROJECT_PROCESS 1✓
|
LOW | 1 | 0 | 100% | 1 | 2026-09-05 |
snapshot · 2026-09-17
실패 클러스터
-
관측됨 PROJECT_PROCESS ERR_MODULE_NOT_FOUND 증거 공백 ×3 1.33.0 executionContext=node · moduleSystem=esm · os=windows · runtime=node@24.13증거 품질: legacy-evidence-incomplete · 환경 변형: 1 · 최초 관측: 2026-08-14 · 마지막 관측: 2026-08-14진단 재검증 후보
-
관측됨 UNKNOWN exit 1 ERR_ASSERTION 증거 공백 ×2 1.33.0 executionContext=node · moduleSystem=esm · os=windows · runtime=node@24.13 sha256:340c5f78ca35…Image hunterzo-egress-lab:local Building · Image hunterzo-egress-lab:local Built · Network hunterzo-egress-lab_fixture_net Creating …· unclassified-diagnostic · gap stage-unknown증거 품질: complete · 환경 변형: 1 · 최초 관측: 2026-09-14 · 마지막 관측: 2026-09-14진단 재검증 후보
-
관측됨 PROJECT_TEST exit 1 ERR_LOAD_URL ×1 1.33.0 executionContext=node · moduleSystem=esm · os=linux · runtime=node@22.23 sha256:a60e7101af87…Contract test failed: Error: Failed to load custom Reporter from basic · at loadCustomReporterModule (fil<path>:<n>:<n>) · at fil<path>:<n>:<n> …javascript/test-runner · test-runner-diagnostic · outer npm test증거 품질: complete · 환경 변형: 1 · 최초 관측: 2026-08-31 · 마지막 관측: 2026-08-31
-
관측됨 UNKNOWN exit 1 증거 공백 ×1 1.33.0 executionContext=node · moduleSystem=esm · os=linux · runtime=node@22.23 sha256:0ce61af3f1a8…<url>]:<n> · const res = await babelPlugin.transform.handler(code, <str>); · ^ · TypeError: Cannot read properties of undefined (reading <str>)node · unclassified-diagnostic · outer node · gap stage-unknown증거 품질: complete · 환경 변형: 1 · 최초 관측: 2026-09-01 · 마지막 관측: 2026-09-01진단 재검증 후보
-
관측됨 UNKNOWN exit 1 증거 공백 ×1 1.33.0 executionContext=node · moduleSystem=esm · os=linux · runtime=node@22.23 sha256:249ecd4b894f…fil<path>:<n> · skipFastRefresh = isProduction || config.command === <str> || config.server.hmr === false; · ^ …node · unclassified-diagnostic · outer node · gap stage-unknown증거 품질: complete · 환경 변형: 1 · 최초 관측: 2026-09-01 · 마지막 관측: 2026-09-01진단 재검증 후보
-
관측됨 UNKNOWN exit 1 증거 공백 ×1 1.33.0 executionContext=node · moduleSystem=esm · os=linux · runtime=node@22.23 sha256:8a6df6b44383…fil<path>:<n> · if (config.experimental.bundledDev) isBundledDev = true; · ^ · TypeError: Cannot read properties of undefined (reading <str>)node · unclassified-diagnostic · outer node · gap stage-unknown증거 품질: complete · 환경 변형: 1 · 최초 관측: 2026-09-01 · 마지막 관측: 2026-09-01진단 재검증 후보
-
관측됨 UNKNOWN exit 1 ERR_ASSERTION 증거 공백 ×1 1.33.0 executionContext=node · moduleSystem=esm · os=linux · runtime=node@22.23 sha256:8b0e67a45c04…node:internal/modules/run_main:<n> · triggerUncaughtException( · ^ · AssertionError [ERR_ASSERTION]: resolves <path> to virtual module IDnode · unclassified-diagnostic · outer node · gap stage-unknown증거 품질: complete · 환경 변형: 1 · 최초 관측: 2026-09-01 · 마지막 관측: 2026-09-01진단 재검증 후보
-
관측됨 UNKNOWN exit 1 ERR_ASSERTION 증거 공백 ×1 1.33.0 executionContext=node · moduleSystem=esm · os=linux · runtime=node@22.23 sha256:9088da2c451a…node:internal/modules/run_main:<n> · triggerUncaughtException( · ^ · AssertionError [ERR_ASSERTION]: load code contains RefreshRuntimenode · unclassified-diagnostic · outer node · gap stage-unknown증거 품질: complete · 환경 변형: 1 · 최초 관측: 2026-09-01 · 마지막 관측: 2026-09-01진단 재검증 후보
-
관측됨 UNKNOWN exit 1 증거 공백 ×1 1.33.0 executionContext=node · moduleSystem=esm · os=linux · runtime=node@22.23 sha256:aaa882de0091…fil<path>:<n> · const hooks = config.plugins.map((plugin) => plugin.api?.reactBabel).filter(defined); · ^ …node · unclassified-diagnostic · outer node · gap stage-unknown증거 품질: complete · 환경 변형: 1 · 최초 관측: 2026-09-01 · 마지막 관측: 2026-09-01진단 재검증 후보
-
관측됨 UNKNOWN exit 1 ERR_PACKAGE_PATH_NOT_EXPORTED 증거 공백 ×1 1.33.0 executionContext=node · moduleSystem=esm · os=linux · runtime=node@22.23 sha256:b9a7518ba7bb…node:internal/modules/esm/resolve:<n> · return new ERR_PACKAGE_PATH_NOT_EXPORTED( · ^ …node · unclassified-diagnostic · outer node · gap stage-unknown증거 품질: complete · 환경 변형: 1 · 최초 관측: 2026-09-01 · 마지막 관측: 2026-09-01진단 재검증 후보
-
관측됨 UNKNOWN exit 1 ERR_ASSERTION 증거 공백 ×1 1.33.0 executionContext=node · moduleSystem=cjs · os=linux · runtime=node@22.23 sha256:986d98189e70…node:internal/modules/run_main:<n> · triggerUncaughtException( · ^ · AssertionError [ERR_ASSERTION]: Expected values to be strictly equal:node · unclassified-diagnostic · outer node · gap stage-unknown증거 품질: complete · 환경 변형: 1 · 최초 관측: 2026-09-04 · 마지막 관측: 2026-09-04진단 재검증 후보
-
관측됨 UNKNOWN exit 1 ERR_PACKAGE_PATH_NOT_EXPORTED 증거 공백 ×1 1.33.0 executionContext=node · moduleSystem=cjs · os=linux · runtime=node@22.23 sha256:e72340c7e3d4…node:internal/modules/cjs/loader:<n> · throw e; · ^ · Error [ERR_PACKAGE_PATH_NOT_EXPORTED]: Package subpath <str> is not defined by <str> in <path>node · unclassified-diagnostic · outer node · gap stage-unknown증거 품질: complete · 환경 변형: 1 · 최초 관측: 2026-09-04 · 마지막 관측: 2026-09-04진단 재검증 후보
가장 많이 보고된 12개를 보여줍니다. 이 좌표에 기록된 실패 클러스터는 43개입니다. 나머지는 단발 보고입니다.