Registrosnpmlightningcss1.33.0bundle
OS × runtime em um relance
Como ler uma célula: O número são as observações registradas entre as quais a taxa divide — um build deixa uma observação por etapa que alcançou, então não conta builds, nem máquinas, nem pessoas. O documento ao lado é outro fato, de outra fonte: se existe uma amostra naquela coordenada e como foi a nossa execução dela ali.
- ainda sem amostra nesta coordenada
- há uma amostra aqui e ainda não a executamos nesta coordenada
- há uma amostra aqui e nossa execução nesta coordenada terminou limpa
- há uma amostra aqui e nossa execução nesta coordenada falhou
- há uma amostra aqui e esta coordenada registra ao mesmo tempo uma execução aprovada e uma reprovada
- nada registrado — desconhecido, nem “funciona” nem “quebrado”
- há um nível abaixo desta célula — clique para abrir
Um documento significa que há uma amostra naquela coordenada. Se ela EXISTE é um fato sobre esta versão e esta API e não muda com o sistema operacional, o runtime ou o gerenciador de pacotes; a COR diz como essa amostra rodou no ambiente que você está vendo.
Exemplos publicados
- lightningcss 1.33.0: bundle Esta rede oferece uma coisa: uma amostra que compila. Ela a executou em um sandbox e guardou o recibo assinado. Não classifica nem garante nada — se o mesmo código compila onde você está, ela não mediu. HOWbundlenode 22.23.2 MIT-0 · 2026-09-02
- lightningcss 1.33.0: bundle Esta rede oferece uma coisa: uma amostra que compila. Ela a executou em um sandbox e guardou o recibo assinado. Não classifica nem garante nada — se o mesmo código compila onde você está, ela não mediu. HOWlightningcss.bundlenode 22.23.2 MIT-0 · 2026-09-05
Matriz de compatibilidade
Observações no nível do projeto e verificações de símbolo/contrato são contadas separadamente e nunca somadas.
Estas contagens não distinguem como o símbolo foi chamado: sobrecargas, formatos de argumentos e opções são agrupados. O que uma forma de chamada específica faz é provado pelo contrato de uma amostra, não por estes números.
| Ambiente | Confiança | Observações | Verificado | Taxa de aprovação | Peers | Visto por último |
|---|---|---|---|---|---|---|
| node 22 · JS · npm · linux glibc · docker
Observações: PROJECT_TEST 1✓ — Verificado: CONTRACT 1✓
|
LOW | 1 | 1 | 100% | 1 · 1✓ | 2026-09-14 |
| node 22 · JS · npm · linux glibc · docker
Observações: PROJECT_TEST 1✓
|
LOW | 1 | 0 | 100% | 1 | 2026-09-17 |
| node 22.23 · JS · npm · linux glibc
Observações: PROJECT_PROCESS 1✓
|
LOW | 1 | 0 | 100% | 1 | 2026-09-02 |
| node 22.23 · JS · npm · linux glibc
Observações: PROJECT_PROCESS 1✓
|
LOW | 1 | 0 | 100% | 1 | 2026-09-05 |
snapshot · 2026-09-17
Clusters de falha
-
observado PROJECT_PROCESS ERR_MODULE_NOT_FOUND Lacuna de evidência ×3 1.33.0 executionContext=node · moduleSystem=esm · os=windows · runtime=node@24.13Qualidade da evidência: legacy-evidence-incomplete · Variantes de ambiente: 1 · Primeiro registro: 2026-08-14 · Visto por último: 2026-08-14Candidato a reverificação diagnóstica
-
observado UNKNOWN exit 1 ERR_ASSERTION Lacuna de evidência ×2 1.33.0 executionContext=node · moduleSystem=esm · os=windows · runtime=node@24.13 sha256:340c5f78ca35…Image hunterzo-egress-lab:local Building · Image hunterzo-egress-lab:local Built · Network hunterzo-egress-lab_fixture_net Creating …· unclassified-diagnostic · gap stage-unknownQualidade da evidência: complete · Variantes de ambiente: 1 · Primeiro registro: 2026-09-14 · Visto por último: 2026-09-14Candidato a reverificação diagnóstica
-
observado PROJECT_TEST exit 1 ERR_LOAD_URL ×1 1.33.0 executionContext=node · moduleSystem=esm · os=linux · runtime=node@22.23 sha256:a60e7101af87…Contract test failed: Error: Failed to load custom Reporter from basic · at loadCustomReporterModule (fil<path>:<n>:<n>) · at fil<path>:<n>:<n> …javascript/test-runner · test-runner-diagnostic · outer npm testQualidade da evidência: complete · Variantes de ambiente: 1 · Primeiro registro: 2026-08-31 · Visto por último: 2026-08-31
-
observado UNKNOWN exit 1 Lacuna de evidência ×1 1.33.0 executionContext=node · moduleSystem=esm · os=linux · runtime=node@22.23 sha256:0ce61af3f1a8…<url>]:<n> · const res = await babelPlugin.transform.handler(code, <str>); · ^ · TypeError: Cannot read properties of undefined (reading <str>)node · unclassified-diagnostic · outer node · gap stage-unknownQualidade da evidência: complete · Variantes de ambiente: 1 · Primeiro registro: 2026-09-01 · Visto por último: 2026-09-01Candidato a reverificação diagnóstica
-
observado UNKNOWN exit 1 Lacuna de evidência ×1 1.33.0 executionContext=node · moduleSystem=esm · os=linux · runtime=node@22.23 sha256:249ecd4b894f…fil<path>:<n> · skipFastRefresh = isProduction || config.command === <str> || config.server.hmr === false; · ^ …node · unclassified-diagnostic · outer node · gap stage-unknownQualidade da evidência: complete · Variantes de ambiente: 1 · Primeiro registro: 2026-09-01 · Visto por último: 2026-09-01Candidato a reverificação diagnóstica
-
observado UNKNOWN exit 1 Lacuna de evidência ×1 1.33.0 executionContext=node · moduleSystem=esm · os=linux · runtime=node@22.23 sha256:8a6df6b44383…fil<path>:<n> · if (config.experimental.bundledDev) isBundledDev = true; · ^ · TypeError: Cannot read properties of undefined (reading <str>)node · unclassified-diagnostic · outer node · gap stage-unknownQualidade da evidência: complete · Variantes de ambiente: 1 · Primeiro registro: 2026-09-01 · Visto por último: 2026-09-01Candidato a reverificação diagnóstica
-
observado UNKNOWN exit 1 ERR_ASSERTION Lacuna de evidência ×1 1.33.0 executionContext=node · moduleSystem=esm · os=linux · runtime=node@22.23 sha256:8b0e67a45c04…node:internal/modules/run_main:<n> · triggerUncaughtException( · ^ · AssertionError [ERR_ASSERTION]: resolves <path> to virtual module IDnode · unclassified-diagnostic · outer node · gap stage-unknownQualidade da evidência: complete · Variantes de ambiente: 1 · Primeiro registro: 2026-09-01 · Visto por último: 2026-09-01Candidato a reverificação diagnóstica
-
observado UNKNOWN exit 1 ERR_ASSERTION Lacuna de evidência ×1 1.33.0 executionContext=node · moduleSystem=esm · os=linux · runtime=node@22.23 sha256:9088da2c451a…node:internal/modules/run_main:<n> · triggerUncaughtException( · ^ · AssertionError [ERR_ASSERTION]: load code contains RefreshRuntimenode · unclassified-diagnostic · outer node · gap stage-unknownQualidade da evidência: complete · Variantes de ambiente: 1 · Primeiro registro: 2026-09-01 · Visto por último: 2026-09-01Candidato a reverificação diagnóstica
-
observado UNKNOWN exit 1 Lacuna de evidência ×1 1.33.0 executionContext=node · moduleSystem=esm · os=linux · runtime=node@22.23 sha256:aaa882de0091…fil<path>:<n> · const hooks = config.plugins.map((plugin) => plugin.api?.reactBabel).filter(defined); · ^ …node · unclassified-diagnostic · outer node · gap stage-unknownQualidade da evidência: complete · Variantes de ambiente: 1 · Primeiro registro: 2026-09-01 · Visto por último: 2026-09-01Candidato a reverificação diagnóstica
-
observado UNKNOWN exit 1 ERR_PACKAGE_PATH_NOT_EXPORTED Lacuna de evidência ×1 1.33.0 executionContext=node · moduleSystem=esm · os=linux · runtime=node@22.23 sha256:b9a7518ba7bb…node:internal/modules/esm/resolve:<n> · return new ERR_PACKAGE_PATH_NOT_EXPORTED( · ^ …node · unclassified-diagnostic · outer node · gap stage-unknownQualidade da evidência: complete · Variantes de ambiente: 1 · Primeiro registro: 2026-09-01 · Visto por último: 2026-09-01Candidato a reverificação diagnóstica
-
observado UNKNOWN exit 1 ERR_ASSERTION Lacuna de evidência ×1 1.33.0 executionContext=node · moduleSystem=cjs · os=linux · runtime=node@22.23 sha256:986d98189e70…node:internal/modules/run_main:<n> · triggerUncaughtException( · ^ · AssertionError [ERR_ASSERTION]: Expected values to be strictly equal:node · unclassified-diagnostic · outer node · gap stage-unknownQualidade da evidência: complete · Variantes de ambiente: 1 · Primeiro registro: 2026-09-04 · Visto por último: 2026-09-04Candidato a reverificação diagnóstica
-
observado UNKNOWN exit 1 ERR_PACKAGE_PATH_NOT_EXPORTED Lacuna de evidência ×1 1.33.0 executionContext=node · moduleSystem=cjs · os=linux · runtime=node@22.23 sha256:e72340c7e3d4…node:internal/modules/cjs/loader:<n> · throw e; · ^ · Error [ERR_PACKAGE_PATH_NOT_EXPORTED]: Package subpath <str> is not defined by <str> in <path>node · unclassified-diagnostic · outer node · gap stage-unknownQualidade da evidência: complete · Variantes de ambiente: 1 · Primeiro registro: 2026-09-04 · Visto por último: 2026-09-04Candidato a reverificação diagnóstica
Mostrando os 12 mais relatados de 43 grupos de falhas registrados. O resto são relatos únicos.