记录cargoyoke-derive0.8.4
环境详情
项目级观测与符号/契约验证分别统计,绝不合并。
这些计数不区分符号的调用方式:重载、参数形态和选项被合并统计。某一具体调用方式的行为由样本的契约证明,而不是由这些数字证明。
| 环境 | 置信度 | 观测 | 验证 | 通过率 | 节点 | 最近观测 |
|---|---|---|---|---|---|---|
| unknown · Rust · cargo · linux glibc
观测: PROJECT_COMPILE 2✓ 24✕ · PROJECT_PROCESS 16✓ · PROJECT_TEST 8✓ — 使用: USED 2✓
|
ELEVATED FAILURE | 50 +2 | 0 | 52% | 1 | 2026-10-21 |
| rust 1 · Rust · cargo · linux musl · docker
使用: USED 2✓
|
LOW | 0 +2 | 0 | — | 1 | 2026-10-21 |
近期失败聚类
-
已观测 PROJECT_COMPILE exit 101 E0599 ×9 0.8.4 os=linux sha256:b07a18e8da2b…error[E0599]: no associated function or constant named `new` found for struct `Adapter` in the current scoperust/rustc · compiler-diagnostic · outer cargo build, cargo check, cargo run, cargo test证据质量: complete · 环境变体: 1 · 首次记录: 2026-10-19 · 最近观测: 2026-10-21
-
已观测 PROJECT_COMPILE exit 101 ×4 0.8.4 os=linux sha256:4c786cbbce8a…error: could not compile `sample` (bin <str>) due to 1 previous errorrust/rustc · compiler-diagnostic · outer cargo run证据质量: complete · 环境变体: 1 · 首次记录: 2026-10-21 · 最近观测: 2026-10-21
-
已观测 PROJECT_COMPILE exit 101 ×3 0.8.4 os=linux sha256:6d7f0ce8254c…error: could not compile `sample-idna-adapter` (bin <str>) due to 1 previous errorrust/rustc · compiler-diagnostic · outer cargo build, cargo check证据质量: complete · 环境变体: 1 · 首次记录: 2026-10-19 · 最近观测: 2026-10-21
-
已观测 PROJECT_COMPILE exit 101 ×1 0.8.4 os=linux sha256:5f8e4e2b88b7…error: could not compile `sample-idna-adapter` (bin <str>) due to 2 previous errorsrust/rustc · compiler-diagnostic · outer cargo run证据质量: complete · 环境变体: 1 · 首次记录: 2026-10-19 · 最近观测: 2026-10-19
-
已观测 PROJECT_COMPILE exit 101 E0599 ×1 0.8.4 os=linux sha256:c2fafad2bab2…error[E0599]: no method named `is_rtl` found for struct `BidiClass` in the current scoperust/rustc · compiler-diagnostic · outer cargo run证据质量: complete · 环境变体: 1 · 首次记录: 2026-10-19 · 最近观测: 2026-10-19
-
已观测 PROJECT_COMPILE exit 101 E0308 ×1 0.8.4 os=linux sha256:0479254218ac…error[E0308]: mismatched typesrust/rustc · compiler-diagnostic · outer cargo run证据质量: complete · 环境变体: 1 · 首次记录: 2026-10-21 · 最近观测: 2026-10-21
-
已观测 PROJECT_COMPILE exit 101 ×1 0.8.4 os=linux sha256:2f19ac80e4df…error: could not compile `sample` (bin <str> test) due to 1 previous error · error: could not compile `sample` (test <str>) due to 1 previous errorrust/rustc · compiler-diagnostic · outer cargo test证据质量: complete · 环境变体: 1 · 首次记录: 2026-10-21 · 最近观测: 2026-10-21
-
已观测 PROJECT_COMPILE exit 101 ×1 0.8.4 os=linux sha256:34891a39f250…error: could not compile `sample_contract` (bin <str>) due to 1 previous errorrust/rustc · compiler-diagnostic · outer cargo run证据质量: complete · 环境变体: 1 · 首次记录: 2026-10-21 · 最近观测: 2026-10-21
-
已观测 PROJECT_COMPILE exit 101 E0277 ×1 0.8.4 os=linux sha256:00c8f7989fac…error[E0277]: `BidiClassMask` doesn't implement `std::fmt::Display`rust/rustc · compiler-diagnostic · outer cargo build证据质量: complete · 环境变体: 1 · 首次记录: 2026-10-21 · 最近观测: 2026-10-21
-
已观测 PROJECT_COMPILE exit 101 ×1 0.8.4 os=linux sha256:a56d87738538…error: could not compile `sample-idna-adapter` (bin <str> test) due to 1 previous errorrust/rustc · compiler-diagnostic · outer cargo test证据质量: complete · 环境变体: 1 · 首次记录: 2026-10-21 · 最近观测: 2026-10-21
-
已观测 PROJECT_COMPILE exit 101 ×1 0.8.4 os=linux sha256:3cf043c845d5…error: could not compile `sample` (test <str>) due to 1 previous error · error: could not compile `sample` (bin <str> test) due to 1 previous errorrust/rustc · compiler-diagnostic · outer cargo test证据质量: complete · 环境变体: 1 · 首次记录: 2026-10-21 · 最近观测: 2026-10-21
符号
暂无带证据的符号。