Registroscargoyoke-derive0.8.4
Detalhe do ambiente
Observações no nível do projeto e verificações de símbolo/contrato são contadas separadamente e nunca somadas.
Estas contagens não distinguem como o símbolo foi chamado: sobrecargas, formatos de argumentos e opções são agrupados. O que uma forma de chamada específica faz é provado pelo contrato de uma amostra, não por estes números.
| Ambiente | Confiança | Observações | Verificado | Taxa de aprovação | Peers | Visto por último |
|---|---|---|---|---|---|---|
| unknown · Rust · cargo · linux glibc
Observações: PROJECT_COMPILE 0✓ 4✕ · PROJECT_PROCESS 7✓ — Uso: USED 1✓
|
ELEVATED FAILURE | 11 +1 | 0 | 64% | 1 | 2026-10-19 |
| rust 1 · Rust · cargo · linux musl · docker
Uso: USED 1✓
|
LOW | 0 +1 | 0 | — | 1 | 2026-10-19 |
Clusters de falha recentes
-
observado PROJECT_COMPILE exit 101 ×1 0.8.4 os=linux sha256:5f8e4e2b88b7…error: could not compile `sample-idna-adapter` (bin <str>) due to 2 previous errorsrust/rustc · compiler-diagnostic · outer cargo runQualidade da evidência: complete · Variantes de ambiente: 1 · Primeiro registro: 2026-10-19 · Visto por último: 2026-10-19
-
observado PROJECT_COMPILE exit 101 E0599 ×1 0.8.4 os=linux sha256:c2fafad2bab2…error[E0599]: no method named `is_rtl` found for struct `BidiClass` in the current scoperust/rustc · compiler-diagnostic · outer cargo runQualidade da evidência: complete · Variantes de ambiente: 1 · Primeiro registro: 2026-10-19 · Visto por último: 2026-10-19
-
observado PROJECT_COMPILE exit 101 ×1 0.8.4 os=linux sha256:6d7f0ce8254c…error: could not compile `sample-idna-adapter` (bin <str>) due to 1 previous errorrust/rustc · compiler-diagnostic · outer cargo buildQualidade da evidência: complete · Variantes de ambiente: 1 · Primeiro registro: 2026-10-19 · Visto por último: 2026-10-19
-
observado PROJECT_COMPILE exit 101 E0599 ×1 0.8.4 os=linux sha256:b07a18e8da2b…error[E0599]: no associated function or constant named `new` found for struct `Adapter` in the current scoperust/rustc · compiler-diagnostic · outer cargo buildQualidade da evidência: complete · Variantes de ambiente: 1 · Primeiro registro: 2026-10-19 · Visto por último: 2026-10-19
Símbolos
Ainda não há símbolos com evidências.