Registroscargoyoke-derive0.8.4
Detalle del entorno
Las observaciones a nivel de proyecto y las verificaciones de símbolo/contrato se cuentan por separado y nunca se combinan.
Estos recuentos no distinguen cómo se llamó al símbolo: las sobrecargas, las formas de los argumentos y las opciones se agrupan. Lo que hace una forma de llamada concreta lo demuestra el contrato de una muestra, no estas cifras.
| Entorno | Confianza | Observaciones | Verificado | Tasa de éxito | Pares | Última observación |
|---|---|---|---|---|---|---|
| unknown · Rust · cargo · linux glibc
Observaciones: PROJECT_COMPILE 0✓ 4✕ · PROJECT_PROCESS 7✓ — Uso: USED 1✓
|
ELEVATED FAILURE | 11 +1 | 0 | 64% | 1 | 2026-10-19 |
| rust 1 · Rust · cargo · linux musl · docker
Uso: USED 1✓
|
LOW | 0 +1 | 0 | — | 1 | 2026-10-19 |
Clústeres de fallos recientes
-
observado PROJECT_COMPILE exit 101 ×1 0.8.4 os=linux sha256:5f8e4e2b88b7…error: could not compile `sample-idna-adapter` (bin <str>) due to 2 previous errorsrust/rustc · compiler-diagnostic · outer cargo runCalidad de evidencia: complete · Variantes de entorno: 1 · Primer registro: 2026-10-19 · Última observación: 2026-10-19
-
observado PROJECT_COMPILE exit 101 E0599 ×1 0.8.4 os=linux sha256:c2fafad2bab2…error[E0599]: no method named `is_rtl` found for struct `BidiClass` in the current scoperust/rustc · compiler-diagnostic · outer cargo runCalidad de evidencia: complete · Variantes de entorno: 1 · Primer registro: 2026-10-19 · Última observación: 2026-10-19
-
observado PROJECT_COMPILE exit 101 ×1 0.8.4 os=linux sha256:6d7f0ce8254c…error: could not compile `sample-idna-adapter` (bin <str>) due to 1 previous errorrust/rustc · compiler-diagnostic · outer cargo buildCalidad de evidencia: complete · Variantes de entorno: 1 · Primer registro: 2026-10-19 · Última observación: 2026-10-19
-
observado PROJECT_COMPILE exit 101 E0599 ×1 0.8.4 os=linux sha256:b07a18e8da2b…error[E0599]: no associated function or constant named `new` found for struct `Adapter` in the current scoperust/rustc · compiler-diagnostic · outer cargo buildCalidad de evidencia: complete · Variantes de entorno: 1 · Primer registro: 2026-10-19 · Última observación: 2026-10-19
Símbolos
Aún no hay símbolos con evidencia.