Записиcargounicode-ident1.0.27
Детали окружения
Наблюдения уровня проекта и проверки символов/контрактов считаются раздельно и никогда не суммируются.
Эти числа не различают, как именно был вызван символ: перегрузки, наборы аргументов и опции считаются вместе. Что делает конкретная форма вызова, доказывает контракт образца, а не эти цифры.
| Окружение | Достоверность | Наблюдения | Проверено | Доля успешных | Пиры | Последнее наблюдение |
|---|---|---|---|---|---|---|
| unknown · Rust · cargo · linux glibc
Наблюдения: PROJECT_COMPILE 0✓ 17✕ · PROJECT_PROCESS 30✓ · PROJECT_TEST 3✓ 2✕ — Использование: USED 1✓ — Проверено: UNKNOWN 0✓ 11✕
|
ELEVATED FAILURE | 52 +1 | 11 | 52 % | 1 | 2026-10-19 |
Недавние кластеры сбоев
-
наблюдалось PROJECT_COMPILE exit 101 ×2 1.0.27 os=linux sha256:e461456111a7…error: could not compile `sample-zerocopy-immutable` (bin <str>) due to 1 previous errorrust/rustc · compiler-diagnostic · outer cargo runКачество данных: complete · Варианты среды: 1 · Первая запись: 2026-10-16 · Последнее наблюдение: 2026-10-16
-
наблюдалось UNKNOWN exit 101 Пробел в данных ×2 1.0.27 os=linux sha256:0a082b31ba29…Updating crates.io index · Locking 6 packages to latest compatible versions · Adding zerocopy v0.8.62 (available: v0.8.63) …cargo · unclassified-diagnostic · outer cargo run · gap stage-unknownКачество данных: complete · Варианты среды: 1 · Первая запись: 2026-10-16 · Последнее наблюдение: 2026-10-16Кандидат на диагностическую перепроверку
-
наблюдалось UNKNOWN exit 101 Пробел в данных ×2 1.0.27 os=linux sha256:8f78f52362b8…Updating crates.io index · Locking 7 packages to latest compatible versions · Adding wasm-bindgen-macro-support v0.2.128 (available: v0.2.129) …cargo · unclassified-diagnostic · outer cargo run · gap stage-unknownКачество данных: complete · Варианты среды: 1 · Первая запись: 2026-10-17 · Последнее наблюдение: 2026-10-17Кандидат на диагностическую перепроверку
-
наблюдалось PROJECT_TEST exit 101 ×2 1.0.27 os=linux sha256:4f232600c5a8…error: test failed, to rerun pass `--test contract` · running 0 tests …rust/test · test-runner-diagnostic · outer cargo testКачество данных: complete · Варианты среды: 1 · Первая запись: 2026-10-18 · Последнее наблюдение: 2026-10-18
-
наблюдалось PROJECT_COMPILE exit 101 E0599 ×1 1.0.27 os=linux sha256:259d35925fd1…error[E0599]: no associated function or constant named `new_zeroed` found for struct `Header` in the current scoperust/rustc · compiler-diagnostic · outer cargo testКачество данных: complete · Варианты среды: 1 · Первая запись: 2026-10-16 · Последнее наблюдение: 2026-10-16
-
наблюдалось PROJECT_COMPILE exit 101 ×1 1.0.27 os=linux sha256:623172eb9244…error: could not compile `sample` (bin <str> test) due to 1 previous errorrust/rustc · compiler-diagnostic · outer cargo testКачество данных: complete · Варианты среды: 1 · Первая запись: 2026-10-16 · Последнее наблюдение: 2026-10-16
-
наблюдалось PROJECT_COMPILE exit 101 E0505 ×1 1.0.27 os=linux sha256:cbcd51a513e3…error[E0505]: cannot move out of `header` because it is borrowedrust/rustc · compiler-diagnostic · outer cargo runКачество данных: complete · Варианты среды: 1 · Первая запись: 2026-10-16 · Последнее наблюдение: 2026-10-16
-
наблюдалось PROJECT_COMPILE exit 101 E0277 ×1 1.0.27 os=linux sha256:e5387c1d1a4b…error[E0277]: the trait bound `T: KnownLayout` is not satisfiedrust/rustc · compiler-diagnostic · outer cargo runКачество данных: complete · Варианты среды: 1 · Первая запись: 2026-10-16 · Последнее наблюдение: 2026-10-16
-
наблюдалось PROJECT_COMPILE exit 101 E0599 ×1 1.0.27 os=linux sha256:0d0e9d01775d…error[E0599]: no method named `zero` found for struct `PacketHeader` in the current scoperust/rustc · compiler-diagnostic · outer cargo runКачество данных: complete · Варианты среды: 1 · Первая запись: 2026-10-16 · Последнее наблюдение: 2026-10-16
-
наблюдалось PROJECT_COMPILE exit 101 E0277 ×1 1.0.27 os=linux sha256:0f9e25b7a406…error[E0277]: the trait bound `PacketHeader: FromBytes` is not satisfiedrust/rustc · compiler-diagnostic · outer cargo runКачество данных: complete · Варианты среды: 1 · Первая запись: 2026-10-16 · Последнее наблюдение: 2026-10-16
-
наблюдалось PROJECT_COMPILE exit 101 ×1 1.0.27 os=linux sha256:36117b64532a…error: could not compile `sample-zerocopy-intobytes` (bin <str>) due to 2 previous errorsrust/rustc · compiler-diagnostic · outer cargo runКачество данных: complete · Варианты среды: 1 · Первая запись: 2026-10-16 · Последнее наблюдение: 2026-10-16
-
наблюдалось PROJECT_COMPILE exit 101 ×1 1.0.27 os=linux sha256:413e0f6a3ea0…error: could not compile `sample-zerocopy-frombytes` (bin <str>) due to 2 previous errorsrust/rustc · compiler-diagnostic · outer cargo runКачество данных: complete · Варианты среды: 1 · Первая запись: 2026-10-16 · Последнее наблюдение: 2026-10-16
Показаны 12 наиболее часто сообщаемых из 26 записанных кластеров отказов. Остальные — единичные сообщения.
Символы
Пока нет символов со свидетельствами.