Aufzeichnungencargounicode-ident1.0.27
Umgebungsdetails
Beobachtungen auf Projektebene und Symbol-/Contract-Verifizierungen werden getrennt gezählt und niemals zusammengerechnet.
Diese Zahlen unterscheiden nicht, wie das Symbol aufgerufen wurde: Überladungen, Argumentformen und Optionen werden zusammengefasst. Was eine bestimmte Aufrufform tut, beweist der Vertrag eines Samples – nicht diese Zahlen.
| Umgebung | Konfidenz | Beobachtungen | Verifiziert | Erfolgsquote | Peers | Zuletzt gesehen |
|---|---|---|---|---|---|---|
| unknown · Rust · cargo · linux glibc
Beobachtungen: PROJECT_COMPILE 0✓ 17✕ · PROJECT_PROCESS 30✓ · PROJECT_TEST 3✓ 2✕ — Nutzung: USED 1✓ — Verifiziert: UNKNOWN 0✓ 11✕
|
ELEVATED FAILURE | 52 +1 | 11 | 52 % | 1 | 2026-10-19 |
Aktuelle Fehler-Cluster
-
beobachtet PROJECT_COMPILE exit 101 ×2 1.0.27 os=linux sha256:e461456111a7…error: could not compile `sample-zerocopy-immutable` (bin <str>) due to 1 previous errorrust/rustc · compiler-diagnostic · outer cargo runBeweisqualität: complete · Umgebungsvarianten: 1 · Zuerst erfasst: 2026-10-16 · Zuletzt gesehen: 2026-10-16
-
beobachtet UNKNOWN exit 101 Beweislücke ×2 1.0.27 os=linux sha256:0a082b31ba29…Updating crates.io index · Locking 6 packages to latest compatible versions · Adding zerocopy v0.8.62 (available: v0.8.63) …cargo · unclassified-diagnostic · outer cargo run · gap stage-unknownBeweisqualität: complete · Umgebungsvarianten: 1 · Zuerst erfasst: 2026-10-16 · Zuletzt gesehen: 2026-10-16Kandidat für diagnostische Neuprüfung
-
beobachtet UNKNOWN exit 101 Beweislücke ×2 1.0.27 os=linux sha256:8f78f52362b8…Updating crates.io index · Locking 7 packages to latest compatible versions · Adding wasm-bindgen-macro-support v0.2.128 (available: v0.2.129) …cargo · unclassified-diagnostic · outer cargo run · gap stage-unknownBeweisqualität: complete · Umgebungsvarianten: 1 · Zuerst erfasst: 2026-10-17 · Zuletzt gesehen: 2026-10-17Kandidat für diagnostische Neuprüfung
-
beobachtet PROJECT_TEST exit 101 ×2 1.0.27 os=linux sha256:4f232600c5a8…error: test failed, to rerun pass `--test contract` · running 0 tests …rust/test · test-runner-diagnostic · outer cargo testBeweisqualität: complete · Umgebungsvarianten: 1 · Zuerst erfasst: 2026-10-18 · Zuletzt gesehen: 2026-10-18
-
beobachtet PROJECT_COMPILE exit 101 E0599 ×1 1.0.27 os=linux sha256:259d35925fd1…error[E0599]: no associated function or constant named `new_zeroed` found for struct `Header` in the current scoperust/rustc · compiler-diagnostic · outer cargo testBeweisqualität: complete · Umgebungsvarianten: 1 · Zuerst erfasst: 2026-10-16 · Zuletzt gesehen: 2026-10-16
-
beobachtet PROJECT_COMPILE exit 101 ×1 1.0.27 os=linux sha256:623172eb9244…error: could not compile `sample` (bin <str> test) due to 1 previous errorrust/rustc · compiler-diagnostic · outer cargo testBeweisqualität: complete · Umgebungsvarianten: 1 · Zuerst erfasst: 2026-10-16 · Zuletzt gesehen: 2026-10-16
-
beobachtet PROJECT_COMPILE exit 101 E0505 ×1 1.0.27 os=linux sha256:cbcd51a513e3…error[E0505]: cannot move out of `header` because it is borrowedrust/rustc · compiler-diagnostic · outer cargo runBeweisqualität: complete · Umgebungsvarianten: 1 · Zuerst erfasst: 2026-10-16 · Zuletzt gesehen: 2026-10-16
-
beobachtet PROJECT_COMPILE exit 101 E0277 ×1 1.0.27 os=linux sha256:e5387c1d1a4b…error[E0277]: the trait bound `T: KnownLayout` is not satisfiedrust/rustc · compiler-diagnostic · outer cargo runBeweisqualität: complete · Umgebungsvarianten: 1 · Zuerst erfasst: 2026-10-16 · Zuletzt gesehen: 2026-10-16
-
beobachtet PROJECT_COMPILE exit 101 E0599 ×1 1.0.27 os=linux sha256:0d0e9d01775d…error[E0599]: no method named `zero` found for struct `PacketHeader` in the current scoperust/rustc · compiler-diagnostic · outer cargo runBeweisqualität: complete · Umgebungsvarianten: 1 · Zuerst erfasst: 2026-10-16 · Zuletzt gesehen: 2026-10-16
-
beobachtet PROJECT_COMPILE exit 101 E0277 ×1 1.0.27 os=linux sha256:0f9e25b7a406…error[E0277]: the trait bound `PacketHeader: FromBytes` is not satisfiedrust/rustc · compiler-diagnostic · outer cargo runBeweisqualität: complete · Umgebungsvarianten: 1 · Zuerst erfasst: 2026-10-16 · Zuletzt gesehen: 2026-10-16
-
beobachtet PROJECT_COMPILE exit 101 ×1 1.0.27 os=linux sha256:36117b64532a…error: could not compile `sample-zerocopy-intobytes` (bin <str>) due to 2 previous errorsrust/rustc · compiler-diagnostic · outer cargo runBeweisqualität: complete · Umgebungsvarianten: 1 · Zuerst erfasst: 2026-10-16 · Zuletzt gesehen: 2026-10-16
-
beobachtet PROJECT_COMPILE exit 101 ×1 1.0.27 os=linux sha256:413e0f6a3ea0…error: could not compile `sample-zerocopy-frombytes` (bin <str>) due to 2 previous errorsrust/rustc · compiler-diagnostic · outer cargo runBeweisqualität: complete · Umgebungsvarianten: 1 · Zuerst erfasst: 2026-10-16 · Zuletzt gesehen: 2026-10-16
Es werden die 12 meistgemeldeten von 26 aufgezeichneten Fehlerclustern gezeigt. Der Rest sind Einzelmeldungen.
Symbole
Noch keine Symbole mit Evidenz.