기록cargounicode-ident1.0.27
환경 상세
프로젝트 수준 관측과 심벌/컨트랙트 검증은 따로 집계하며 절대 합산하지 않습니다.
이 수치는 심볼을 어떻게 호출했는지 구분하지 않습니다. 오버로드, 인자 형태, 옵션이 한데 묶여 집계됩니다. 특정 호출 형태가 어떻게 동작하는지는 이 숫자가 아니라 샘플의 계약이 증명합니다.
| 환경 | 신뢰도 | 관측 | 검증 | 통과율 | 피어 | 마지막 관측 |
|---|---|---|---|---|---|---|
| unknown · Rust · cargo · linux glibc
관측: PROJECT_COMPILE 0✓ 17✕ · PROJECT_PROCESS 30✓ · PROJECT_TEST 3✓ 2✕ — 사용: USED 1✓ — 검증: UNKNOWN 0✓ 11✕
|
ELEVATED FAILURE | 52 +1 | 11 | 52% | 1 | 2026-10-19 |
최근 실패 클러스터
-
관측됨 PROJECT_COMPILE exit 101 ×2 1.0.27 os=linux sha256:e461456111a7…error: could not compile `sample-zerocopy-immutable` (bin <str>) due to 1 previous errorrust/rustc · compiler-diagnostic · outer cargo run증거 품질: complete · 환경 변형: 1 · 최초 관측: 2026-10-16 · 마지막 관측: 2026-10-16
-
관측됨 UNKNOWN exit 101 증거 공백 ×2 1.0.27 os=linux sha256:0a082b31ba29…Updating crates.io index · Locking 6 packages to latest compatible versions · Adding zerocopy v0.8.62 (available: v0.8.63) …cargo · unclassified-diagnostic · outer cargo run · gap stage-unknown증거 품질: complete · 환경 변형: 1 · 최초 관측: 2026-10-16 · 마지막 관측: 2026-10-16진단 재검증 후보
-
관측됨 UNKNOWN exit 101 증거 공백 ×2 1.0.27 os=linux sha256:8f78f52362b8…Updating crates.io index · Locking 7 packages to latest compatible versions · Adding wasm-bindgen-macro-support v0.2.128 (available: v0.2.129) …cargo · unclassified-diagnostic · outer cargo run · gap stage-unknown증거 품질: complete · 환경 변형: 1 · 최초 관측: 2026-10-17 · 마지막 관측: 2026-10-17진단 재검증 후보
-
관측됨 PROJECT_TEST exit 101 ×2 1.0.27 os=linux sha256:4f232600c5a8…error: test failed, to rerun pass `--test contract` · running 0 tests …rust/test · test-runner-diagnostic · outer cargo test증거 품질: complete · 환경 변형: 1 · 최초 관측: 2026-10-18 · 마지막 관측: 2026-10-18
-
관측됨 PROJECT_COMPILE exit 101 E0599 ×1 1.0.27 os=linux sha256:259d35925fd1…error[E0599]: no associated function or constant named `new_zeroed` found for struct `Header` in the current scoperust/rustc · compiler-diagnostic · outer cargo test증거 품질: complete · 환경 변형: 1 · 최초 관측: 2026-10-16 · 마지막 관측: 2026-10-16
-
관측됨 PROJECT_COMPILE exit 101 ×1 1.0.27 os=linux sha256:623172eb9244…error: could not compile `sample` (bin <str> test) due to 1 previous errorrust/rustc · compiler-diagnostic · outer cargo test증거 품질: complete · 환경 변형: 1 · 최초 관측: 2026-10-16 · 마지막 관측: 2026-10-16
-
관측됨 PROJECT_COMPILE exit 101 E0505 ×1 1.0.27 os=linux sha256:cbcd51a513e3…error[E0505]: cannot move out of `header` because it is borrowedrust/rustc · compiler-diagnostic · outer cargo run증거 품질: complete · 환경 변형: 1 · 최초 관측: 2026-10-16 · 마지막 관측: 2026-10-16
-
관측됨 PROJECT_COMPILE exit 101 E0277 ×1 1.0.27 os=linux sha256:e5387c1d1a4b…error[E0277]: the trait bound `T: KnownLayout` is not satisfiedrust/rustc · compiler-diagnostic · outer cargo run증거 품질: complete · 환경 변형: 1 · 최초 관측: 2026-10-16 · 마지막 관측: 2026-10-16
-
관측됨 PROJECT_COMPILE exit 101 E0599 ×1 1.0.27 os=linux sha256:0d0e9d01775d…error[E0599]: no method named `zero` found for struct `PacketHeader` in the current scoperust/rustc · compiler-diagnostic · outer cargo run증거 품질: complete · 환경 변형: 1 · 최초 관측: 2026-10-16 · 마지막 관측: 2026-10-16
-
관측됨 PROJECT_COMPILE exit 101 E0277 ×1 1.0.27 os=linux sha256:0f9e25b7a406…error[E0277]: the trait bound `PacketHeader: FromBytes` is not satisfiedrust/rustc · compiler-diagnostic · outer cargo run증거 품질: complete · 환경 변형: 1 · 최초 관측: 2026-10-16 · 마지막 관측: 2026-10-16
-
관측됨 PROJECT_COMPILE exit 101 ×1 1.0.27 os=linux sha256:36117b64532a…error: could not compile `sample-zerocopy-intobytes` (bin <str>) due to 2 previous errorsrust/rustc · compiler-diagnostic · outer cargo run증거 품질: complete · 환경 변형: 1 · 최초 관측: 2026-10-16 · 마지막 관측: 2026-10-16
-
관측됨 PROJECT_COMPILE exit 101 ×1 1.0.27 os=linux sha256:413e0f6a3ea0…error: could not compile `sample-zerocopy-frombytes` (bin <str>) due to 2 previous errorsrust/rustc · compiler-diagnostic · outer cargo run증거 품질: complete · 환경 변형: 1 · 최초 관측: 2026-10-16 · 마지막 관측: 2026-10-16
가장 많이 보고된 12개를 보여줍니다. 이 좌표에 기록된 실패 클러스터는 26개입니다. 나머지는 단발 보고입니다.
심벌
아직 증거가 있는 심벌이 없습니다.