记录cargotokio1.53.1axum::Router::layer
4 个包共同声明 — 此证据无法判断该 API 属于谁
已发布的示例
- tokio 1.53.1: Configure request payload size limits in axum using DefaultBodyLimit to prevent automatic 413 Payload Too Large rejections on buffering extractors (Bytes, String, Json) at the default 2MB boundary, override limits per route or sub-router, and stream unbuffered raw requests without limits 本网络只提供一件事:能构建的样本。它在沙箱中运行并保留签名回执。它不评级、不担保——同样的代码能否在你的环境构建,它没有测量过。 HOWaxum::extract::DefaultBodyLimitaxum::extract::DefaultBodyLimit::maxaxum::extract::DefaultBodyLimit::disableaxum::extract::Jsonaxum::extract::Requestaxum::body::Bytesaxum::Router::routeaxum::Router::layeraxum::Router::nestrust MIT-0 · 2026-08-16
- tokio 1.53.1: Protect axum routes with stateful middleware using from_fn_with_state, isolate route_layer from 404 fallbacks, and manage bottom-to-top layer execution order 本网络只提供一件事:能构建的样本。它在沙箱中运行并保留签名回执。它不评级、不担保——同样的代码能否在你的环境构建,它没有测量过。 HOWaxum::middleware::from_fnaxum::middleware::from_fn_with_stateaxum::middleware::Nextaxum::Router::route_layeraxum::Router::layeraxum::extract::Extensionaxum::extract::Stateaxum::extract::Requestrust MIT-0 · 2026-08-16
兼容性矩阵
项目级观测与符号/契约验证分别统计,绝不合并。
这些计数不区分符号的调用方式:重载、参数形态和选项被合并统计。某一具体调用方式的行为由样本的契约证明,而不是由这些数字证明。
| 环境 | 置信度 | 观测 | 验证 | 通过率 | 节点 | 最近观测 |
|---|---|---|---|---|---|---|
| rust 1 · Rust · cargo · linux musl · docker
验证: CONTRACT 2✓ 2✕
|
ELEVATED FAILURE | 0 | 4 | 50% | 0 · 2✓ | 2026-09-08 |
snapshot · 2026-09-15
失败聚类
-
已观测 PROJECT_TEST 证据缺口 ×2 1.43.0 → 1.53.1 executionContext=rust · os=linux · runtime=rust@1证据质量: legacy-evidence-incomplete · 环境变体: 1 · 首次记录: 2026-09-08 · 最近观测: 2026-09-08诊断复验候选
-
已观测 PROJECT_COMPILE exit 101 ×2 1.53.1 os=linux sha256:a67fd218023f…error: could not compile `test-hyper-util` (bin <str>) due to 1 previous errorrust/rustc · compiler-diagnostic · outer cargo run证据质量: complete · 环境变体: 1 · 首次记录: 2026-09-19 · 最近观测: 2026-09-19
-
已观测 PROJECT_COMPILE exit 101 ×1 1.53.1 os=linux sha256:1043b6df5638…error: could not compile `test-hyper-util` (bin <str>) due to 1 previous error; 1 warning emittedrust/rustc · compiler-diagnostic · outer cargo check证据质量: complete · 环境变体: 1 · 首次记录: 2026-09-19 · 最近观测: 2026-09-19
-
已观测 PROJECT_COMPILE exit 101 E0624 ×1 1.53.1 os=linux sha256:65fda95c6b71…error[E0624]: method `remaining` is privaterust/rustc · compiler-diagnostic · outer cargo run证据质量: complete · 环境变体: 1 · 首次记录: 2026-09-19 · 最近观测: 2026-09-19
-
已观测 PROJECT_COMPILE exit 101 E0599 ×1 1.53.1 os=linux sha256:689d8da7053d…error[E0599]: no method named `http1_only` found for mutable reference `&mut hyper_util::client::legacy::Builder` in the current scoperust/rustc · compiler-diagnostic · outer cargo run证据质量: complete · 环境变体: 1 · 首次记录: 2026-09-19 · 最近观测: 2026-09-19
-
已观测 PROJECT_COMPILE exit 101 E0433 ×1 1.53.1 os=linux sha256:b3ae21627e63…error[E0433]: cannot find module or crate `tokio` in this scoperust/rustc · compiler-diagnostic · outer cargo check证据质量: complete · 环境变体: 1 · 首次记录: 2026-09-19 · 最近观测: 2026-09-19
-
已观测 PROJECT_COMPILE exit 101 E0432 ×1 1.53.1 os=linux sha256:cce7c6259bba…error[E0432]: unresolved imports `hyper_util::rt::WithHyperIo`, `hyper_util::rt::WithTokioIo`rust/rustc · compiler-diagnostic · outer cargo check证据质量: complete · 环境变体: 1 · 首次记录: 2026-09-19 · 最近观测: 2026-09-19
-
已观测 PROJECT_COMPILE exit 101 ×1 1.53.1 os=linux sha256:ec2184db47b8…error: could not compile `sample-hyper` (bin <str>) due to 5 previous errors; 1 warning emittedrust/rustc · compiler-diagnostic · outer cargo run证据质量: complete · 环境变体: 1 · 首次记录: 2026-09-19 · 最近观测: 2026-09-19