Relevéscargotokio1.53.1axum::Router::layer
revendiqué par 4 paquets — cette preuve ne peut pas dire à qui appartient l’API
Exemples publiés
- tokio 1.53.1: Configure request payload size limits in axum using DefaultBodyLimit to prevent automatic 413 Payload Too Large rejections on buffering extractors (Bytes, String, Json) at the default 2MB boundary, override limits per route or sub-router, and stream unbuffered raw requests without limits Ce réseau offre une seule chose : un échantillon qui compile. Il l'a exécuté dans un bac à sable et conservé le reçu signé. Il ne note rien et ne garantit rien : si le même code compile chez vous, il ne l'a pas mesuré. HOWaxum::extract::DefaultBodyLimitaxum::extract::DefaultBodyLimit::maxaxum::extract::DefaultBodyLimit::disableaxum::extract::Jsonaxum::extract::Requestaxum::body::Bytesaxum::Router::routeaxum::Router::layeraxum::Router::nestrust MIT-0 · 2026-08-16
- tokio 1.53.1: Protect axum routes with stateful middleware using from_fn_with_state, isolate route_layer from 404 fallbacks, and manage bottom-to-top layer execution order Ce réseau offre une seule chose : un échantillon qui compile. Il l'a exécuté dans un bac à sable et conservé le reçu signé. Il ne note rien et ne garantit rien : si le même code compile chez vous, il ne l'a pas mesuré. HOWaxum::middleware::from_fnaxum::middleware::from_fn_with_stateaxum::middleware::Nextaxum::Router::route_layeraxum::Router::layeraxum::extract::Extensionaxum::extract::Stateaxum::extract::Requestrust MIT-0 · 2026-08-16
Matrice de compatibilité
Les observations au niveau projet et les vérifications de symbole/contrat sont comptées séparément et jamais additionnées.
Ces chiffres ne distinguent pas la façon dont le symbole a été appelé : surcharges, formes d'arguments et options sont regroupées. Ce que fait une forme d'appel précise est prouvé par le contrat d'un échantillon, pas par ces nombres.
| Environnement | Confiance | Observations | Vérifié | Taux de réussite | Pairs | Dernière observation |
|---|---|---|---|---|---|---|
| rust 1 · Rust · cargo · linux musl · docker
Vérifié: CONTRACT 2✓ 2✕
|
ELEVATED FAILURE | 0 | 4 | 50 % | 0 · 2✓ | 2026-09-08 |
snapshot · 2026-09-15
Clusters d'échecs
-
observé PROJECT_TEST Lacune de preuve ×2 1.43.0 → 1.53.1 executionContext=rust · os=linux · runtime=rust@1Qualité de preuve: legacy-evidence-incomplete · Variantes d’environnement: 1 · Premier relevé: 2026-09-08 · Dernière observation: 2026-09-08Candidat à une revérification diagnostique
-
observé PROJECT_COMPILE exit 101 ×2 1.53.1 os=linux sha256:a67fd218023f…error: could not compile `test-hyper-util` (bin <str>) due to 1 previous errorrust/rustc · compiler-diagnostic · outer cargo runQualité de preuve: complete · Variantes d’environnement: 1 · Premier relevé: 2026-09-19 · Dernière observation: 2026-09-19
-
observé PROJECT_COMPILE exit 101 ×1 1.53.1 os=linux sha256:1043b6df5638…error: could not compile `test-hyper-util` (bin <str>) due to 1 previous error; 1 warning emittedrust/rustc · compiler-diagnostic · outer cargo checkQualité de preuve: complete · Variantes d’environnement: 1 · Premier relevé: 2026-09-19 · Dernière observation: 2026-09-19
-
observé PROJECT_COMPILE exit 101 E0624 ×1 1.53.1 os=linux sha256:65fda95c6b71…error[E0624]: method `remaining` is privaterust/rustc · compiler-diagnostic · outer cargo runQualité de preuve: complete · Variantes d’environnement: 1 · Premier relevé: 2026-09-19 · Dernière observation: 2026-09-19
-
observé PROJECT_COMPILE exit 101 E0599 ×1 1.53.1 os=linux sha256:689d8da7053d…error[E0599]: no method named `http1_only` found for mutable reference `&mut hyper_util::client::legacy::Builder` in the current scoperust/rustc · compiler-diagnostic · outer cargo runQualité de preuve: complete · Variantes d’environnement: 1 · Premier relevé: 2026-09-19 · Dernière observation: 2026-09-19
-
observé PROJECT_COMPILE exit 101 E0433 ×1 1.53.1 os=linux sha256:b3ae21627e63…error[E0433]: cannot find module or crate `tokio` in this scoperust/rustc · compiler-diagnostic · outer cargo checkQualité de preuve: complete · Variantes d’environnement: 1 · Premier relevé: 2026-09-19 · Dernière observation: 2026-09-19
-
observé PROJECT_COMPILE exit 101 E0432 ×1 1.53.1 os=linux sha256:cce7c6259bba…error[E0432]: unresolved imports `hyper_util::rt::WithHyperIo`, `hyper_util::rt::WithTokioIo`rust/rustc · compiler-diagnostic · outer cargo checkQualité de preuve: complete · Variantes d’environnement: 1 · Premier relevé: 2026-09-19 · Dernière observation: 2026-09-19
-
observé PROJECT_COMPILE exit 101 ×1 1.53.1 os=linux sha256:ec2184db47b8…error: could not compile `sample-hyper` (bin <str>) due to 5 previous errors; 1 warning emittedrust/rustc · compiler-diagnostic · outer cargo runQualité de preuve: complete · Variantes d’environnement: 1 · Premier relevé: 2026-09-19 · Dernière observation: 2026-09-19