Registroscargotokio1.53.1axum::Router::layer
reclamado por 4 paquetes — esta evidencia no puede decir de quién es la API
Ejemplos publicados
- tokio 1.53.1: Configure request payload size limits in axum using DefaultBodyLimit to prevent automatic 413 Payload Too Large rejections on buffering extractors (Bytes, String, Json) at the default 2MB boundary, override limits per route or sub-router, and stream unbuffered raw requests without limits Esta red ofrece una sola cosa: una muestra que compila. La ejecutó en un sandbox y guardó el recibo firmado. No califica ni garantiza nada: si el mismo código compila donde estás no es algo que haya medido. HOWaxum::extract::DefaultBodyLimitaxum::extract::DefaultBodyLimit::maxaxum::extract::DefaultBodyLimit::disableaxum::extract::Jsonaxum::extract::Requestaxum::body::Bytesaxum::Router::routeaxum::Router::layeraxum::Router::nestrust MIT-0 · 2026-08-16
- tokio 1.53.1: Protect axum routes with stateful middleware using from_fn_with_state, isolate route_layer from 404 fallbacks, and manage bottom-to-top layer execution order Esta red ofrece una sola cosa: una muestra que compila. La ejecutó en un sandbox y guardó el recibo firmado. No califica ni garantiza nada: si el mismo código compila donde estás no es algo que haya medido. HOWaxum::middleware::from_fnaxum::middleware::from_fn_with_stateaxum::middleware::Nextaxum::Router::route_layeraxum::Router::layeraxum::extract::Extensionaxum::extract::Stateaxum::extract::Requestrust MIT-0 · 2026-08-16
Matriz de compatibilidad
Las observaciones a nivel de proyecto y las verificaciones de símbolo/contrato se cuentan por separado y nunca se combinan.
Estos recuentos no distinguen cómo se llamó al símbolo: las sobrecargas, las formas de los argumentos y las opciones se agrupan. Lo que hace una forma de llamada concreta lo demuestra el contrato de una muestra, no estas cifras.
| Entorno | Confianza | Observaciones | Verificado | Tasa de éxito | Pares | Última observación |
|---|---|---|---|---|---|---|
| rust 1 · Rust · cargo · linux musl · docker
Verificado: CONTRACT 2✓ 2✕
|
ELEVATED FAILURE | 0 | 4 | 50% | 0 · 2✓ | 2026-09-08 |
snapshot · 2026-09-15
Clústeres de fallos
-
observado PROJECT_TEST Brecha de evidencia ×2 1.43.0 → 1.53.1 executionContext=rust · os=linux · runtime=rust@1Calidad de evidencia: legacy-evidence-incomplete · Variantes de entorno: 1 · Primer registro: 2026-09-08 · Última observación: 2026-09-08Candidato a reverificación diagnóstica
-
observado PROJECT_COMPILE exit 101 ×2 1.53.1 os=linux sha256:a67fd218023f…error: could not compile `test-hyper-util` (bin <str>) due to 1 previous errorrust/rustc · compiler-diagnostic · outer cargo runCalidad de evidencia: complete · Variantes de entorno: 1 · Primer registro: 2026-09-19 · Última observación: 2026-09-19
-
observado PROJECT_COMPILE exit 101 ×1 1.53.1 os=linux sha256:1043b6df5638…error: could not compile `test-hyper-util` (bin <str>) due to 1 previous error; 1 warning emittedrust/rustc · compiler-diagnostic · outer cargo checkCalidad de evidencia: complete · Variantes de entorno: 1 · Primer registro: 2026-09-19 · Última observación: 2026-09-19
-
observado PROJECT_COMPILE exit 101 E0624 ×1 1.53.1 os=linux sha256:65fda95c6b71…error[E0624]: method `remaining` is privaterust/rustc · compiler-diagnostic · outer cargo runCalidad de evidencia: complete · Variantes de entorno: 1 · Primer registro: 2026-09-19 · Última observación: 2026-09-19
-
observado PROJECT_COMPILE exit 101 E0599 ×1 1.53.1 os=linux sha256:689d8da7053d…error[E0599]: no method named `http1_only` found for mutable reference `&mut hyper_util::client::legacy::Builder` in the current scoperust/rustc · compiler-diagnostic · outer cargo runCalidad de evidencia: complete · Variantes de entorno: 1 · Primer registro: 2026-09-19 · Última observación: 2026-09-19
-
observado PROJECT_COMPILE exit 101 E0433 ×1 1.53.1 os=linux sha256:b3ae21627e63…error[E0433]: cannot find module or crate `tokio` in this scoperust/rustc · compiler-diagnostic · outer cargo checkCalidad de evidencia: complete · Variantes de entorno: 1 · Primer registro: 2026-09-19 · Última observación: 2026-09-19
-
observado PROJECT_COMPILE exit 101 E0432 ×1 1.53.1 os=linux sha256:cce7c6259bba…error[E0432]: unresolved imports `hyper_util::rt::WithHyperIo`, `hyper_util::rt::WithTokioIo`rust/rustc · compiler-diagnostic · outer cargo checkCalidad de evidencia: complete · Variantes de entorno: 1 · Primer registro: 2026-09-19 · Última observación: 2026-09-19
-
observado PROJECT_COMPILE exit 101 ×1 1.53.1 os=linux sha256:ec2184db47b8…error: could not compile `sample-hyper` (bin <str>) due to 5 previous errors; 1 warning emittedrust/rustc · compiler-diagnostic · outer cargo runCalidad de evidencia: complete · Variantes de entorno: 1 · Primer registro: 2026-09-19 · Última observación: 2026-09-19