Recordscargotokio1.53.1axum::Router::layer
shared with 4 packages — this evidence cannot say whose API it is
Published samples
- tokio 1.53.1: Configure request payload size limits in axum using DefaultBodyLimit to prevent automatic 413 Payload Too Large rejections on buffering extractors (Bytes, String, Json) at the default 2MB boundary, override limits per route or sub-router, and stream unbuffered raw requests without limits This network offers one thing: a sample that builds. It ran the sample in a sandbox and kept the signed receipt. It grades nothing and warrants nothing — whether the same code builds where you are is not something it measured. HOWaxum::extract::DefaultBodyLimitaxum::extract::DefaultBodyLimit::maxaxum::extract::DefaultBodyLimit::disableaxum::extract::Jsonaxum::extract::Requestaxum::body::Bytesaxum::Router::routeaxum::Router::layeraxum::Router::nestrust MIT-0 · 2026-08-16
- tokio 1.53.1: Protect axum routes with stateful middleware using from_fn_with_state, isolate route_layer from 404 fallbacks, and manage bottom-to-top layer execution order This network offers one thing: a sample that builds. It ran the sample in a sandbox and kept the signed receipt. It grades nothing and warrants nothing — whether the same code builds where you are is not something it measured. HOWaxum::middleware::from_fnaxum::middleware::from_fn_with_stateaxum::middleware::Nextaxum::Router::route_layeraxum::Router::layeraxum::extract::Extensionaxum::extract::Stateaxum::extract::Requestrust MIT-0 · 2026-08-16
Compatibility matrix
Project-level observations and symbol/contract verifications are counted separately and never combined.
These counts do not distinguish how the symbol was called: overloads, argument shapes and options are pooled together. What a particular call shape does is proven by a sample's contract, not by these numbers.
| Environment | Confidence | Observations | Verified | Pass rate | Peers | Last seen |
|---|---|---|---|---|---|---|
| rust 1 · Rust · cargo · linux musl · docker
Verified: CONTRACT 2✓ 2✕
|
ELEVATED FAILURE | 0 | 4 | 50% | 0 · 2✓ | 2026-09-08 |
snapshot · 2026-09-15
Failure clusters
-
observed PROJECT_TEST Evidence gap ×2 1.43.0 → 1.53.1 executionContext=rust · os=linux · runtime=rust@1Evidence quality: legacy-evidence-incomplete · Environment variants: 1 · First recorded: 2026-09-08 · Last seen: 2026-09-08Diagnostic re-verification candidate
-
observed PROJECT_COMPILE exit 101 ×2 1.53.1 os=linux sha256:a67fd218023f…error: could not compile `test-hyper-util` (bin <str>) due to 1 previous errorrust/rustc · compiler-diagnostic · outer cargo runEvidence quality: complete · Environment variants: 1 · First recorded: 2026-09-19 · Last seen: 2026-09-19
-
observed PROJECT_COMPILE exit 101 ×1 1.53.1 os=linux sha256:1043b6df5638…error: could not compile `test-hyper-util` (bin <str>) due to 1 previous error; 1 warning emittedrust/rustc · compiler-diagnostic · outer cargo checkEvidence quality: complete · Environment variants: 1 · First recorded: 2026-09-19 · Last seen: 2026-09-19
-
observed PROJECT_COMPILE exit 101 E0624 ×1 1.53.1 os=linux sha256:65fda95c6b71…error[E0624]: method `remaining` is privaterust/rustc · compiler-diagnostic · outer cargo runEvidence quality: complete · Environment variants: 1 · First recorded: 2026-09-19 · Last seen: 2026-09-19
-
observed PROJECT_COMPILE exit 101 E0599 ×1 1.53.1 os=linux sha256:689d8da7053d…error[E0599]: no method named `http1_only` found for mutable reference `&mut hyper_util::client::legacy::Builder` in the current scoperust/rustc · compiler-diagnostic · outer cargo runEvidence quality: complete · Environment variants: 1 · First recorded: 2026-09-19 · Last seen: 2026-09-19
-
observed PROJECT_COMPILE exit 101 E0433 ×1 1.53.1 os=linux sha256:b3ae21627e63…error[E0433]: cannot find module or crate `tokio` in this scoperust/rustc · compiler-diagnostic · outer cargo checkEvidence quality: complete · Environment variants: 1 · First recorded: 2026-09-19 · Last seen: 2026-09-19
-
observed PROJECT_COMPILE exit 101 E0432 ×1 1.53.1 os=linux sha256:cce7c6259bba…error[E0432]: unresolved imports `hyper_util::rt::WithHyperIo`, `hyper_util::rt::WithTokioIo`rust/rustc · compiler-diagnostic · outer cargo checkEvidence quality: complete · Environment variants: 1 · First recorded: 2026-09-19 · Last seen: 2026-09-19
-
observed PROJECT_COMPILE exit 101 ×1 1.53.1 os=linux sha256:ec2184db47b8…error: could not compile `sample-hyper` (bin <str>) due to 5 previous errors; 1 warning emittedrust/rustc · compiler-diagnostic · outer cargo runEvidence quality: complete · Environment variants: 1 · First recorded: 2026-09-19 · Last seen: 2026-09-19