记录cargoshlex2.0.1
环境详情
项目级观测与符号/契约验证分别统计,绝不合并。
这些计数不区分符号的调用方式:重载、参数形态和选项被合并统计。某一具体调用方式的行为由样本的契约证明,而不是由这些数字证明。
| 环境 | 置信度 | 观测 | 验证 | 通过率 | 节点 | 最近观测 |
|---|---|---|---|---|---|---|
| unknown · Rust · cargo · linux glibc
观测: PROJECT_COMPILE 2✓ 13✕ · PROJECT_PROCESS 20✓ · PROJECT_TEST 1✓ — 使用: USED 1✓ — 验证: UNKNOWN 0✓ 5✕
|
ELEVATED FAILURE | 36 +1 | 5 | 56% | 1 | 2026-10-09 |
近期失败聚类
-
已观测 PROJECT_COMPILE exit 101 E0616 ×2 2.0.1 os=linux sha256:581c58c1c7ac…error[E0616]: field `output_len` of struct `ring::digest::Algorithm` is privaterust/rustc · compiler-diagnostic · outer cargo run, cargo test证据质量: complete · 环境变体: 1 · 首次记录: 2026-09-20 · 最近观测: 2026-09-20
-
已观测 PROJECT_COMPILE exit 101 ×1 2.0.1 os=linux sha256:104f536c9704…error: could not compile `probe` (bin <str>) due to 2 previous errorsrust/rustc · compiler-diagnostic · outer cargo run证据质量: complete · 环境变体: 1 · 首次记录: 2026-09-19 · 最近观测: 2026-09-19
-
已观测 PROJECT_COMPILE exit 101 ×1 2.0.1 os=linux sha256:24ec7982ffbe…error: could not compile `test-ring` (bin <str>) due to 1 previous errorrust/rustc · compiler-diagnostic · outer cargo run证据质量: complete · 环境变体: 1 · 首次记录: 2026-09-20 · 最近观测: 2026-09-20
-
已观测 PROJECT_COMPILE exit 101 E0599 ×1 2.0.1 os=linux sha256:5b0ef21330f9…error[E0599]: no associated function or constant named `SERVER_AUTH` found for struct `KeyPurposeId<'a>` in the current scoperust/rustc · compiler-diagnostic · outer cargo check证据质量: complete · 环境变体: 1 · 首次记录: 2026-09-19 · 最近观测: 2026-09-19
-
已观测 PROJECT_COMPILE exit 101 ×1 2.0.1 os=linux sha256:5ef222f665b3…error: could not compile `sample-ring-digest` (bin <str>) due to 2 previous errorsrust/rustc · compiler-diagnostic · outer cargo run证据质量: complete · 环境变体: 1 · 首次记录: 2026-09-20 · 最近观测: 2026-09-20
-
已观测 PROJECT_COMPILE exit 101 E0599 ×1 2.0.1 os=linux sha256:8c25141af213…error[E0599]: no variant, associated function, or constant named `CACompromise` found for enum `webpki::RevocationReason` in the current scoperust/rustc · compiler-diagnostic · outer cargo run证据质量: complete · 环境变体: 1 · 首次记录: 2026-09-19 · 最近观测: 2026-09-19
-
已观测 PROJECT_COMPILE exit 101 E0423 ×1 2.0.1 os=linux sha256:a4ccb879052a…error[E0423]: cannot initialize a tuple struct which contains private fieldsrust/rustc · compiler-diagnostic · outer cargo run证据质量: complete · 环境变体: 1 · 首次记录: 2026-09-19 · 最近观测: 2026-09-19
-
已观测 PROJECT_COMPILE exit 101 E0133 ×1 2.0.1 os=linux sha256:b3defba5e9b3…error[E0133]: call to unsafe function `set_var` is unsafe and requires unsafe blockrust/rustc · compiler-diagnostic · outer cargo run证据质量: complete · 环境变体: 1 · 首次记录: 2026-09-19 · 最近观测: 2026-09-19
-
已观测 PROJECT_COMPILE exit 101 ×1 2.0.1 os=linux sha256:b7a3fa5852a8…error: could not compile `ring-digest-test` (lib test) due to 1 previous error; 1 warning emittedrust/rustc · compiler-diagnostic · outer cargo test证据质量: complete · 环境变体: 1 · 首次记录: 2026-09-20 · 最近观测: 2026-09-20
-
已观测 PROJECT_COMPILE exit 101 ×1 2.0.1 os=linux sha256:d5a10aa5fcc7…error: could not compile `probe` (bin <str>) due to 1 previous errorrust/rustc · compiler-diagnostic · outer cargo check证据质量: complete · 环境变体: 1 · 首次记录: 2026-09-19 · 最近观测: 2026-09-19
-
已观测 PROJECT_COMPILE exit 101 E0599 ×1 2.0.1 os=linux sha256:ddd135697656…error[E0599]: no method named `public_key` found for struct `Ed25519KeyPair` in the current scoperust/rustc · compiler-diagnostic · outer cargo run证据质量: complete · 环境变体: 1 · 首次记录: 2026-09-20 · 最近观测: 2026-09-20
-
已观测 PROJECT_COMPILE exit 101 ×1 2.0.1 os=linux sha256:e77b7f5807c8…error: could not compile `test-cc` (bin <str>) due to 3 previous errorsrust/rustc · compiler-diagnostic · outer cargo run证据质量: complete · 环境变体: 1 · 首次记录: 2026-09-19 · 最近观测: 2026-09-19
显示报告最多的 12 个。此坐标记录的失败聚类共 17 个。其余为单次报告。
符号
暂无带证据的符号。