기록cargoshlex2.0.1
환경 상세
프로젝트 수준 관측과 심벌/컨트랙트 검증은 따로 집계하며 절대 합산하지 않습니다.
이 수치는 심볼을 어떻게 호출했는지 구분하지 않습니다. 오버로드, 인자 형태, 옵션이 한데 묶여 집계됩니다. 특정 호출 형태가 어떻게 동작하는지는 이 숫자가 아니라 샘플의 계약이 증명합니다.
| 환경 | 신뢰도 | 관측 | 검증 | 통과율 | 피어 | 마지막 관측 |
|---|---|---|---|---|---|---|
| unknown · Rust · cargo · linux glibc
관측: PROJECT_COMPILE 2✓ 13✕ · PROJECT_PROCESS 20✓ · PROJECT_TEST 1✓ — 사용: USED 1✓ — 검증: UNKNOWN 0✓ 5✕
|
ELEVATED FAILURE | 36 +1 | 5 | 56% | 1 | 2026-10-09 |
최근 실패 클러스터
-
관측됨 PROJECT_COMPILE exit 101 E0616 ×2 2.0.1 os=linux sha256:581c58c1c7ac…error[E0616]: field `output_len` of struct `ring::digest::Algorithm` is privaterust/rustc · compiler-diagnostic · outer cargo run, cargo test증거 품질: complete · 환경 변형: 1 · 최초 관측: 2026-09-20 · 마지막 관측: 2026-09-20
-
관측됨 PROJECT_COMPILE exit 101 ×1 2.0.1 os=linux sha256:104f536c9704…error: could not compile `probe` (bin <str>) due to 2 previous errorsrust/rustc · compiler-diagnostic · outer cargo run증거 품질: complete · 환경 변형: 1 · 최초 관측: 2026-09-19 · 마지막 관측: 2026-09-19
-
관측됨 PROJECT_COMPILE exit 101 ×1 2.0.1 os=linux sha256:24ec7982ffbe…error: could not compile `test-ring` (bin <str>) due to 1 previous errorrust/rustc · compiler-diagnostic · outer cargo run증거 품질: complete · 환경 변형: 1 · 최초 관측: 2026-09-20 · 마지막 관측: 2026-09-20
-
관측됨 PROJECT_COMPILE exit 101 E0599 ×1 2.0.1 os=linux sha256:5b0ef21330f9…error[E0599]: no associated function or constant named `SERVER_AUTH` found for struct `KeyPurposeId<'a>` in the current scoperust/rustc · compiler-diagnostic · outer cargo check증거 품질: complete · 환경 변형: 1 · 최초 관측: 2026-09-19 · 마지막 관측: 2026-09-19
-
관측됨 PROJECT_COMPILE exit 101 ×1 2.0.1 os=linux sha256:5ef222f665b3…error: could not compile `sample-ring-digest` (bin <str>) due to 2 previous errorsrust/rustc · compiler-diagnostic · outer cargo run증거 품질: complete · 환경 변형: 1 · 최초 관측: 2026-09-20 · 마지막 관측: 2026-09-20
-
관측됨 PROJECT_COMPILE exit 101 E0599 ×1 2.0.1 os=linux sha256:8c25141af213…error[E0599]: no variant, associated function, or constant named `CACompromise` found for enum `webpki::RevocationReason` in the current scoperust/rustc · compiler-diagnostic · outer cargo run증거 품질: complete · 환경 변형: 1 · 최초 관측: 2026-09-19 · 마지막 관측: 2026-09-19
-
관측됨 PROJECT_COMPILE exit 101 E0423 ×1 2.0.1 os=linux sha256:a4ccb879052a…error[E0423]: cannot initialize a tuple struct which contains private fieldsrust/rustc · compiler-diagnostic · outer cargo run증거 품질: complete · 환경 변형: 1 · 최초 관측: 2026-09-19 · 마지막 관측: 2026-09-19
-
관측됨 PROJECT_COMPILE exit 101 E0133 ×1 2.0.1 os=linux sha256:b3defba5e9b3…error[E0133]: call to unsafe function `set_var` is unsafe and requires unsafe blockrust/rustc · compiler-diagnostic · outer cargo run증거 품질: complete · 환경 변형: 1 · 최초 관측: 2026-09-19 · 마지막 관측: 2026-09-19
-
관측됨 PROJECT_COMPILE exit 101 ×1 2.0.1 os=linux sha256:b7a3fa5852a8…error: could not compile `ring-digest-test` (lib test) due to 1 previous error; 1 warning emittedrust/rustc · compiler-diagnostic · outer cargo test증거 품질: complete · 환경 변형: 1 · 최초 관측: 2026-09-20 · 마지막 관측: 2026-09-20
-
관측됨 PROJECT_COMPILE exit 101 ×1 2.0.1 os=linux sha256:d5a10aa5fcc7…error: could not compile `probe` (bin <str>) due to 1 previous errorrust/rustc · compiler-diagnostic · outer cargo check증거 품질: complete · 환경 변형: 1 · 최초 관측: 2026-09-19 · 마지막 관측: 2026-09-19
-
관측됨 PROJECT_COMPILE exit 101 E0599 ×1 2.0.1 os=linux sha256:ddd135697656…error[E0599]: no method named `public_key` found for struct `Ed25519KeyPair` in the current scoperust/rustc · compiler-diagnostic · outer cargo run증거 품질: complete · 환경 변형: 1 · 최초 관측: 2026-09-20 · 마지막 관측: 2026-09-20
-
관측됨 PROJECT_COMPILE exit 101 ×1 2.0.1 os=linux sha256:e77b7f5807c8…error: could not compile `test-cc` (bin <str>) due to 3 previous errorsrust/rustc · compiler-diagnostic · outer cargo run증거 품질: complete · 환경 변형: 1 · 최초 관측: 2026-09-19 · 마지막 관측: 2026-09-19
가장 많이 보고된 12개를 보여줍니다. 이 좌표에 기록된 실패 클러스터는 17개입니다. 나머지는 단발 보고입니다.
심벌
아직 증거가 있는 심벌이 없습니다.