Recordscargoshlex2.0.1
Environment detail
Project-level observations and symbol/contract verifications are counted separately and never combined.
These counts do not distinguish how the symbol was called: overloads, argument shapes and options are pooled together. What a particular call shape does is proven by a sample's contract, not by these numbers.
| Environment | Confidence | Observations | Verified | Pass rate | Peers | Last seen |
|---|---|---|---|---|---|---|
| unknown · Rust · cargo · linux glibc
Observations: PROJECT_COMPILE 2✓ 13✕ · PROJECT_PROCESS 20✓ · PROJECT_TEST 1✓ — Usage: USED 1✓ — Verified: UNKNOWN 0✓ 5✕
|
ELEVATED FAILURE | 36 +1 | 5 | 56% | 1 | 2026-10-09 |
Recent failure clusters
-
observed PROJECT_COMPILE exit 101 E0616 ×2 2.0.1 os=linux sha256:581c58c1c7ac…error[E0616]: field `output_len` of struct `ring::digest::Algorithm` is privaterust/rustc · compiler-diagnostic · outer cargo run, cargo testEvidence quality: complete · Environment variants: 1 · First recorded: 2026-09-20 · Last seen: 2026-09-20
-
observed PROJECT_COMPILE exit 101 ×1 2.0.1 os=linux sha256:104f536c9704…error: could not compile `probe` (bin <str>) due to 2 previous errorsrust/rustc · compiler-diagnostic · outer cargo runEvidence quality: complete · Environment variants: 1 · First recorded: 2026-09-19 · Last seen: 2026-09-19
-
observed PROJECT_COMPILE exit 101 ×1 2.0.1 os=linux sha256:24ec7982ffbe…error: could not compile `test-ring` (bin <str>) due to 1 previous errorrust/rustc · compiler-diagnostic · outer cargo runEvidence quality: complete · Environment variants: 1 · First recorded: 2026-09-20 · Last seen: 2026-09-20
-
observed PROJECT_COMPILE exit 101 E0599 ×1 2.0.1 os=linux sha256:5b0ef21330f9…error[E0599]: no associated function or constant named `SERVER_AUTH` found for struct `KeyPurposeId<'a>` in the current scoperust/rustc · compiler-diagnostic · outer cargo checkEvidence quality: complete · Environment variants: 1 · First recorded: 2026-09-19 · Last seen: 2026-09-19
-
observed PROJECT_COMPILE exit 101 ×1 2.0.1 os=linux sha256:5ef222f665b3…error: could not compile `sample-ring-digest` (bin <str>) due to 2 previous errorsrust/rustc · compiler-diagnostic · outer cargo runEvidence quality: complete · Environment variants: 1 · First recorded: 2026-09-20 · Last seen: 2026-09-20
-
observed PROJECT_COMPILE exit 101 E0599 ×1 2.0.1 os=linux sha256:8c25141af213…error[E0599]: no variant, associated function, or constant named `CACompromise` found for enum `webpki::RevocationReason` in the current scoperust/rustc · compiler-diagnostic · outer cargo runEvidence quality: complete · Environment variants: 1 · First recorded: 2026-09-19 · Last seen: 2026-09-19
-
observed PROJECT_COMPILE exit 101 E0423 ×1 2.0.1 os=linux sha256:a4ccb879052a…error[E0423]: cannot initialize a tuple struct which contains private fieldsrust/rustc · compiler-diagnostic · outer cargo runEvidence quality: complete · Environment variants: 1 · First recorded: 2026-09-19 · Last seen: 2026-09-19
-
observed PROJECT_COMPILE exit 101 E0133 ×1 2.0.1 os=linux sha256:b3defba5e9b3…error[E0133]: call to unsafe function `set_var` is unsafe and requires unsafe blockrust/rustc · compiler-diagnostic · outer cargo runEvidence quality: complete · Environment variants: 1 · First recorded: 2026-09-19 · Last seen: 2026-09-19
-
observed PROJECT_COMPILE exit 101 ×1 2.0.1 os=linux sha256:b7a3fa5852a8…error: could not compile `ring-digest-test` (lib test) due to 1 previous error; 1 warning emittedrust/rustc · compiler-diagnostic · outer cargo testEvidence quality: complete · Environment variants: 1 · First recorded: 2026-09-20 · Last seen: 2026-09-20
-
observed PROJECT_COMPILE exit 101 ×1 2.0.1 os=linux sha256:d5a10aa5fcc7…error: could not compile `probe` (bin <str>) due to 1 previous errorrust/rustc · compiler-diagnostic · outer cargo checkEvidence quality: complete · Environment variants: 1 · First recorded: 2026-09-19 · Last seen: 2026-09-19
-
observed PROJECT_COMPILE exit 101 E0599 ×1 2.0.1 os=linux sha256:ddd135697656…error[E0599]: no method named `public_key` found for struct `Ed25519KeyPair` in the current scoperust/rustc · compiler-diagnostic · outer cargo runEvidence quality: complete · Environment variants: 1 · First recorded: 2026-09-20 · Last seen: 2026-09-20
-
observed PROJECT_COMPILE exit 101 ×1 2.0.1 os=linux sha256:e77b7f5807c8…error: could not compile `test-cc` (bin <str>) due to 3 previous errorsrust/rustc · compiler-diagnostic · outer cargo runEvidence quality: complete · Environment variants: 1 · First recorded: 2026-09-19 · Last seen: 2026-09-19
Showing the 12 most-reported of 17 recorded failure clusters. The rest are single reports.
Symbols
No symbols with evidence yet.