기록cargor-efi6.0.0
어떤 심볼이 어디서 돌아갔나
이 버전의 심볼 × 운영체제입니다. 셀을 클릭하면 패키지 호환성 큐브로 들어갑니다.
1○ 12026-10-14
셀 읽는 법: 숫자는 비율이 딛고 선 기록된 관측 수입니다 — 한 번의 빌드가 도달한 단계마다 관측이 하나씩 남으므로, 빌드 수도 머신 수도 사람 수도 아닙니다. 옆의 문서는 출처가 다른 별개의 사실입니다: 그 좌표에 샘플이 있는지, 그리고 우리가 거기서 실행한 결과가 어떻는지입니다.
- 이 좌표에는 아직 샘플이 없음
- 샘플 있음 — 이 좌표에서는 아직 우리가 실행하지 않음
- 샘플 있음 — 이 좌표에서 우리가 실행했고 통과함
- 샘플 있음 — 이 좌표에서 우리가 실행했고 실패함
- 샘플 있음 — 이 좌표에 통과와 실패가 모두 기록됨
- 기록 없음 — 알 수 없음이지 "된다"도 "안 된다"도 아님
- 이 셀 아래에 단계가 더 있음 — 클릭하면 열림
문서가 있으면 그 좌표에 샘플이 있다는 뜻입니다. 샘플이 존재하는지는 이 버전과 이 API에 대한 사실이라 OS·런타임·패키지 매니저가 바뀌어도 달라지지 않고, 문서의 색은 지금 보고 있는 환경에서 그 샘플이 어떻게 실행됐는지를 말합니다.
환경 상세
프로젝트 수준 관측과 심벌/컨트랙트 검증은 따로 집계하며 절대 합산하지 않습니다.
이 수치는 심볼을 어떻게 호출했는지 구분하지 않습니다. 오버로드, 인자 형태, 옵션이 한데 묶여 집계됩니다. 특정 호출 형태가 어떻게 동작하는지는 이 숫자가 아니라 샘플의 계약이 증명합니다.
| 환경 | 신뢰도 | 관측 | 검증 | 통과율 | 피어 | 마지막 관측 |
|---|---|---|---|---|---|---|
| unknown · Rust · cargo · linux glibc
관측: PROJECT_COMPILE 0✓ 5✕ · PROJECT_PROCESS 4✓ · PROJECT_TEST 2✓ — 사용: USED 2✓ — 검증: UNKNOWN 0✓ 1✕
|
ELEVATED FAILURE | 11 +2 | 1 | 50% | 1 | 2026-10-13 |
| rust 1 · Rust · cargo · linux musl · docker
관측: PROJECT_LOAD 2✓ · PROJECT_TEST 2✓ — 사용: USED 2✓ — 검증: CONTRACT 2✓
|
LOW | 4 +2 | 2 | 100% | 1 · 1✓ | 2026-10-14 |
최근 실패 클러스터
-
관측됨 PROJECT_COMPILE exit 101 ×2 6.0.0 os=linux sha256:351e3507cee8…error: could not compile `sample-r-efi` (bin <str>) due to 2 previous errorsrust/rustc · compiler-diagnostic · outer cargo run증거 품질: complete · 환경 변형: 1 · 최초 관측: 2026-10-13 · 마지막 관측: 2026-10-13
-
관측됨 PROJECT_COMPILE exit 101 E0599 ×1 6.0.0 os=linux sha256:07939576eb1e…error[E0599]: no method named `to_fields` found for struct `Guid` in the current scoperust/rustc · compiler-diagnostic · outer cargo run증거 품질: complete · 환경 변형: 1 · 최초 관측: 2026-10-13 · 마지막 관측: 2026-10-13
-
관측됨 PROJECT_COMPILE exit 101 E0133 ×1 6.0.0 os=linux sha256:99e894f4f94f…error[E0133]: call to unsafe function is unsafe and requires unsafe function or blockrust/rustc · compiler-diagnostic · outer cargo run증거 품질: complete · 환경 변형: 1 · 최초 관측: 2026-10-13 · 마지막 관측: 2026-10-13
-
관측됨 PROJECT_COMPILE exit 101 E0425 ×1 6.0.0 os=linux sha256:ea0c16144dfe…error[E0425]: cannot find value `SYSTEM_TABLE_REVISION_2_100` in module `efi`rust/rustc · compiler-diagnostic · outer cargo run증거 품질: complete · 환경 변형: 1 · 최초 관측: 2026-10-13 · 마지막 관측: 2026-10-13
-
관측됨 UNKNOWN exit 101 증거 공백 ×1 6.0.0 os=linux sha256:b9a0fe86cd4b…Compiling sample-r-efi v0.1.0 (<path> · Finished `dev` profile [unoptimized + debuginfo] target(s) in 0.57s · Running `target/debug/sample-r-efi` …cargo · unclassified-diagnostic · outer cargo run · gap stage-unknown증거 품질: complete · 환경 변형: 1 · 최초 관측: 2026-10-13 · 마지막 관측: 2026-10-13진단 재검증 후보
심벌
- r_efi 1 1/1회 통과
공개한 샘플
- r-efi 6.0.0 이 네트워크가 제공하는 것은 하나입니다. 빌드되는 샘플. 샌드박스에서 돌리고 서명된 영수증을 보관합니다. 등급을 매기지 않고 무엇도 보증하지 않습니다 — 같은 코드가 당신 환경에서 빌드되는지는 측정한 적이 없습니다. HOW MIT-0 · 2026-10-13