Relevéscargor-efi6.0.0
Quel symbole a tourné où
Symboles × systèmes d'exploitation pour cette version. Les cellules mènent au cube de compatibilité du paquet.
Lire une cellule : Le nombre, ce sont les observations enregistrées que le taux divise : une compilation dépose une observation par étape atteinte, ce n'est donc ni un nombre de builds, ni de machines, ni de personnes. Le document à côté est un autre fait, d'une autre source : l'existence d'un échantillon à cette coordonnée, et le résultat de notre exécution là-bas.
- pas encore d'échantillon à cette coordonnée
- il y a un échantillon ici et nous ne l'avons pas encore exécuté à cette coordonnée
- il y a un échantillon ici et notre exécution à cette coordonnée s'est terminée proprement
- il y a un échantillon ici et notre exécution à cette coordonnée a échoué
- il y a un échantillon ici et cette coordonnée enregistre à la fois une exécution réussie et une exécution en échec
- rien enregistré — inconnu, ni « fonctionne » ni « cassé »
- il y a un niveau sous cette case — cliquez pour l'ouvrir
Un document signifie qu'il y a un échantillon à cette coordonnée. Son EXISTENCE est un fait sur cette version et cette API et ne change pas avec l'OS, le runtime ou le gestionnaire de paquets ; sa COULEUR dit comment cet échantillon s'est exécuté dans l'environnement que vous regardez.
Détail de l'environnement
Les observations au niveau projet et les vérifications de symbole/contrat sont comptées séparément et jamais additionnées.
Ces chiffres ne distinguent pas la façon dont le symbole a été appelé : surcharges, formes d'arguments et options sont regroupées. Ce que fait une forme d'appel précise est prouvé par le contrat d'un échantillon, pas par ces nombres.
| Environnement | Confiance | Observations | Vérifié | Taux de réussite | Pairs | Dernière observation |
|---|---|---|---|---|---|---|
| unknown · Rust · cargo · linux glibc
Observations: PROJECT_COMPILE 0✓ 5✕ · PROJECT_PROCESS 4✓ · PROJECT_TEST 2✓ — Usage: USED 2✓ — Vérifié: UNKNOWN 0✓ 1✕
|
ELEVATED FAILURE | 11 +2 | 1 | 50 % | 1 | 2026-10-13 |
| rust 1 · Rust · cargo · linux musl · docker
Observations: PROJECT_LOAD 2✓ · PROJECT_TEST 2✓ — Usage: USED 2✓ — Vérifié: CONTRACT 2✓
|
LOW | 4 +2 | 2 | 100 % | 1 · 1✓ | 2026-10-14 |
Clusters d'échecs récents
-
observé PROJECT_COMPILE exit 101 ×2 6.0.0 os=linux sha256:351e3507cee8…error: could not compile `sample-r-efi` (bin <str>) due to 2 previous errorsrust/rustc · compiler-diagnostic · outer cargo runQualité de preuve: complete · Variantes d’environnement: 1 · Premier relevé: 2026-10-13 · Dernière observation: 2026-10-13
-
observé PROJECT_COMPILE exit 101 E0599 ×1 6.0.0 os=linux sha256:07939576eb1e…error[E0599]: no method named `to_fields` found for struct `Guid` in the current scoperust/rustc · compiler-diagnostic · outer cargo runQualité de preuve: complete · Variantes d’environnement: 1 · Premier relevé: 2026-10-13 · Dernière observation: 2026-10-13
-
observé PROJECT_COMPILE exit 101 E0133 ×1 6.0.0 os=linux sha256:99e894f4f94f…error[E0133]: call to unsafe function is unsafe and requires unsafe function or blockrust/rustc · compiler-diagnostic · outer cargo runQualité de preuve: complete · Variantes d’environnement: 1 · Premier relevé: 2026-10-13 · Dernière observation: 2026-10-13
-
observé PROJECT_COMPILE exit 101 E0425 ×1 6.0.0 os=linux sha256:ea0c16144dfe…error[E0425]: cannot find value `SYSTEM_TABLE_REVISION_2_100` in module `efi`rust/rustc · compiler-diagnostic · outer cargo runQualité de preuve: complete · Variantes d’environnement: 1 · Premier relevé: 2026-10-13 · Dernière observation: 2026-10-13
-
observé UNKNOWN exit 101 Lacune de preuve ×1 6.0.0 os=linux sha256:b9a0fe86cd4b…Compiling sample-r-efi v0.1.0 (<path> · Finished `dev` profile [unoptimized + debuginfo] target(s) in 0.57s · Running `target/debug/sample-r-efi` …cargo · unclassified-diagnostic · outer cargo run · gap stage-unknownQualité de preuve: complete · Variantes d’environnement: 1 · Premier relevé: 2026-10-13 · Dernière observation: 2026-10-13Candidat à une revérification diagnostique
Symboles
- r_efi 1 1 exécutions sur 1 réussies
Exemples publiés
- r-efi 6.0.0 Ce réseau offre une seule chose : un échantillon qui compile. Il l'a exécuté dans un bac à sable et conservé le reçu signé. Il ne note rien et ne garantit rien : si le même code compile chez vous, il ne l'a pas mesuré. HOW MIT-0 · 2026-10-13