Записиcargor-efi6.0.0r_efi
Опубликованные примеры
- r-efi 6.0.0: r_efi Эта сеть предлагает одно: образец, который собирается. Она запустила его в песочнице и сохранила подписанную квитанцию. Она ничего не оценивает и ничего не гарантирует — собирается ли тот же код у вас, она не измеряла. HOWr_efi MIT-0 · 2026-10-13
Матрица совместимости
Наблюдения уровня проекта и проверки символов/контрактов считаются раздельно и никогда не суммируются.
Эти числа не различают, как именно был вызван символ: перегрузки, наборы аргументов и опции считаются вместе. Что делает конкретная форма вызова, доказывает контракт образца, а не эти цифры.
| Окружение | Достоверность | Наблюдения | Проверено | Доля успешных | Пиры | Последнее наблюдение |
|---|---|---|---|---|---|---|
| unknown · Rust · cargo · linux glibc
Наблюдения: PROJECT_PROCESS 3✓
|
LOW | 3 | 0 | 100 % | 1 | 2026-10-13 |
| rust 1 · Rust · cargo · linux musl · docker
Наблюдения: PROJECT_TEST 2✓ — Проверено: CONTRACT 1✓
|
LOW | 2 | 1 | 100 % | 1 · 1✓ | 2026-10-14 |
snapshot · 2026-10-14
Кластеры сбоев
-
наблюдалось PROJECT_COMPILE exit 101 ×2 6.0.0 os=linux sha256:351e3507cee8…error: could not compile `sample-r-efi` (bin <str>) due to 2 previous errorsrust/rustc · compiler-diagnostic · outer cargo runКачество данных: complete · Варианты среды: 1 · Первая запись: 2026-10-13 · Последнее наблюдение: 2026-10-13
-
наблюдалось PROJECT_COMPILE exit 101 E0599 ×1 6.0.0 os=linux sha256:07939576eb1e…error[E0599]: no method named `to_fields` found for struct `Guid` in the current scoperust/rustc · compiler-diagnostic · outer cargo runКачество данных: complete · Варианты среды: 1 · Первая запись: 2026-10-13 · Последнее наблюдение: 2026-10-13
-
наблюдалось PROJECT_COMPILE exit 101 E0133 ×1 6.0.0 os=linux sha256:99e894f4f94f…error[E0133]: call to unsafe function is unsafe and requires unsafe function or blockrust/rustc · compiler-diagnostic · outer cargo runКачество данных: complete · Варианты среды: 1 · Первая запись: 2026-10-13 · Последнее наблюдение: 2026-10-13
-
наблюдалось PROJECT_COMPILE exit 101 E0425 ×1 6.0.0 os=linux sha256:ea0c16144dfe…error[E0425]: cannot find value `SYSTEM_TABLE_REVISION_2_100` in module `efi`rust/rustc · compiler-diagnostic · outer cargo runКачество данных: complete · Варианты среды: 1 · Первая запись: 2026-10-13 · Последнее наблюдение: 2026-10-13
-
наблюдалось UNKNOWN exit 101 Пробел в данных ×1 6.0.0 os=linux sha256:b9a0fe86cd4b…Compiling sample-r-efi v0.1.0 (<path> · Finished `dev` profile [unoptimized + debuginfo] target(s) in 0.57s · Running `target/debug/sample-r-efi` …cargo · unclassified-diagnostic · outer cargo run · gap stage-unknownКачество данных: complete · Варианты среды: 1 · Первая запись: 2026-10-13 · Последнее наблюдение: 2026-10-13Кандидат на диагностическую перепроверку