Registroscargor-efi6.0.0r_efi
Exemplos publicados
- r-efi 6.0.0: r_efi Esta rede oferece uma coisa: uma amostra que compila. Ela a executou em um sandbox e guardou o recibo assinado. Não classifica nem garante nada — se o mesmo código compila onde você está, ela não mediu. HOWr_efi MIT-0 · 2026-10-13
Matriz de compatibilidade
Observações no nível do projeto e verificações de símbolo/contrato são contadas separadamente e nunca somadas.
Estas contagens não distinguem como o símbolo foi chamado: sobrecargas, formatos de argumentos e opções são agrupados. O que uma forma de chamada específica faz é provado pelo contrato de uma amostra, não por estes números.
| Ambiente | Confiança | Observações | Verificado | Taxa de aprovação | Peers | Visto por último |
|---|---|---|---|---|---|---|
| unknown · Rust · cargo · linux glibc
Observações: PROJECT_PROCESS 3✓
|
LOW | 3 | 0 | 100% | 1 | 2026-10-13 |
| rust 1 · Rust · cargo · linux musl · docker
Observações: PROJECT_TEST 2✓ — Verificado: CONTRACT 1✓
|
LOW | 2 | 1 | 100% | 1 · 1✓ | 2026-10-14 |
snapshot · 2026-10-14
Clusters de falha
-
observado PROJECT_COMPILE exit 101 ×2 6.0.0 os=linux sha256:351e3507cee8…error: could not compile `sample-r-efi` (bin <str>) due to 2 previous errorsrust/rustc · compiler-diagnostic · outer cargo runQualidade da evidência: complete · Variantes de ambiente: 1 · Primeiro registro: 2026-10-13 · Visto por último: 2026-10-13
-
observado PROJECT_COMPILE exit 101 E0599 ×1 6.0.0 os=linux sha256:07939576eb1e…error[E0599]: no method named `to_fields` found for struct `Guid` in the current scoperust/rustc · compiler-diagnostic · outer cargo runQualidade da evidência: complete · Variantes de ambiente: 1 · Primeiro registro: 2026-10-13 · Visto por último: 2026-10-13
-
observado PROJECT_COMPILE exit 101 E0133 ×1 6.0.0 os=linux sha256:99e894f4f94f…error[E0133]: call to unsafe function is unsafe and requires unsafe function or blockrust/rustc · compiler-diagnostic · outer cargo runQualidade da evidência: complete · Variantes de ambiente: 1 · Primeiro registro: 2026-10-13 · Visto por último: 2026-10-13
-
observado PROJECT_COMPILE exit 101 E0425 ×1 6.0.0 os=linux sha256:ea0c16144dfe…error[E0425]: cannot find value `SYSTEM_TABLE_REVISION_2_100` in module `efi`rust/rustc · compiler-diagnostic · outer cargo runQualidade da evidência: complete · Variantes de ambiente: 1 · Primeiro registro: 2026-10-13 · Visto por último: 2026-10-13
-
observado UNKNOWN exit 101 Lacuna de evidência ×1 6.0.0 os=linux sha256:b9a0fe86cd4b…Compiling sample-r-efi v0.1.0 (<path> · Finished `dev` profile [unoptimized + debuginfo] target(s) in 0.57s · Running `target/debug/sample-r-efi` …cargo · unclassified-diagnostic · outer cargo run · gap stage-unknownQualidade da evidência: complete · Variantes de ambiente: 1 · Primeiro registro: 2026-10-13 · Visto por último: 2026-10-13Candidato a reverificação diagnóstica