Recordscargor-efi6.0.0r_efi
Published samples
- r-efi 6.0.0: r_efi This network offers one thing: a sample that builds. It ran the sample in a sandbox and kept the signed receipt. It grades nothing and warrants nothing — whether the same code builds where you are is not something it measured. HOWr_efi MIT-0 · 2026-10-13
Compatibility matrix
Project-level observations and symbol/contract verifications are counted separately and never combined.
These counts do not distinguish how the symbol was called: overloads, argument shapes and options are pooled together. What a particular call shape does is proven by a sample's contract, not by these numbers.
| Environment | Confidence | Observations | Verified | Pass rate | Peers | Last seen |
|---|---|---|---|---|---|---|
| unknown · Rust · cargo · linux glibc
Observations: PROJECT_PROCESS 3✓
|
LOW | 3 | 0 | 100% | 1 | 2026-10-13 |
| rust 1 · Rust · cargo · linux musl · docker
Observations: PROJECT_TEST 2✓ — Verified: CONTRACT 1✓
|
LOW | 2 | 1 | 100% | 1 · 1✓ | 2026-10-14 |
snapshot · 2026-10-14
Failure clusters
-
observed PROJECT_COMPILE exit 101 ×2 6.0.0 os=linux sha256:351e3507cee8…error: could not compile `sample-r-efi` (bin <str>) due to 2 previous errorsrust/rustc · compiler-diagnostic · outer cargo runEvidence quality: complete · Environment variants: 1 · First recorded: 2026-10-13 · Last seen: 2026-10-13
-
observed PROJECT_COMPILE exit 101 E0599 ×1 6.0.0 os=linux sha256:07939576eb1e…error[E0599]: no method named `to_fields` found for struct `Guid` in the current scoperust/rustc · compiler-diagnostic · outer cargo runEvidence quality: complete · Environment variants: 1 · First recorded: 2026-10-13 · Last seen: 2026-10-13
-
observed PROJECT_COMPILE exit 101 E0133 ×1 6.0.0 os=linux sha256:99e894f4f94f…error[E0133]: call to unsafe function is unsafe and requires unsafe function or blockrust/rustc · compiler-diagnostic · outer cargo runEvidence quality: complete · Environment variants: 1 · First recorded: 2026-10-13 · Last seen: 2026-10-13
-
observed PROJECT_COMPILE exit 101 E0425 ×1 6.0.0 os=linux sha256:ea0c16144dfe…error[E0425]: cannot find value `SYSTEM_TABLE_REVISION_2_100` in module `efi`rust/rustc · compiler-diagnostic · outer cargo runEvidence quality: complete · Environment variants: 1 · First recorded: 2026-10-13 · Last seen: 2026-10-13
-
observed UNKNOWN exit 101 Evidence gap ×1 6.0.0 os=linux sha256:b9a0fe86cd4b…Compiling sample-r-efi v0.1.0 (<path> · Finished `dev` profile [unoptimized + debuginfo] target(s) in 0.57s · Running `target/debug/sample-r-efi` …cargo · unclassified-diagnostic · outer cargo run · gap stage-unknownEvidence quality: complete · Environment variants: 1 · First recorded: 2026-10-13 · Last seen: 2026-10-13Diagnostic re-verification candidate