Записиcargoquote1.0.47quote::format_ident
Опубликованные примеры
- quote 1.0.47: quote::format_ident Эта сеть предлагает одно: образец, который собирается. Она запустила его в песочнице и сохранила подписанную квитанцию. Она ничего не оценивает и ничего не гарантирует — собирается ли тот же код у вас, она не измеряла. HOWquote::format_ident MIT-0 · 2026-09-14
Матрица совместимости
Наблюдения уровня проекта и проверки символов/контрактов считаются раздельно и никогда не суммируются.
Эти числа не различают, как именно был вызван символ: перегрузки, наборы аргументов и опции считаются вместе. Что делает конкретная форма вызова, доказывает контракт образца, а не эти цифры.
| Окружение | Достоверность | Наблюдения | Проверено | Доля успешных | Пиры | Последнее наблюдение |
|---|---|---|---|---|---|---|
| unknown · Rust · cargo · linux glibc
Наблюдения: PROJECT_COMPILE 0✓ 4✕ · PROJECT_PROCESS 3✓ · PROJECT_TEST 2✓ 1✕
|
ELEVATED FAILURE | 10 | 0 | 50 % | 1 | 2026-09-14 |
| rust 1 · Rust · cargo · linux musl · docker
Наблюдения: PROJECT_TEST 2✓ — Проверено: CONTRACT 1✓
|
LOW | 2 | 1 | 100 % | 1 · 1✓ | 2026-09-17 |
snapshot · 2026-09-17
Кластеры сбоев
-
наблюдалось PROJECT_COMPILE exit 101 ×1 1.0.47 os=linux quote::format_ident sha256:0d5a8e2ccc86…error: could not compile `quote-test` (bin <str>) due to 1 previous error; 1 warning emittedrust/rustc · compiler-diagnostic · outer cargo runКачество данных: complete · Варианты среды: 1 · Первая запись: 2026-09-14 · Последнее наблюдение: 2026-09-14
-
наблюдалось PROJECT_COMPILE exit 101 E0432 ×1 1.0.47 os=linux quote::format_ident sha256:4a6dd64b7a9b…error[E0432]: unresolved import `proc_macro2`rust/rustc · compiler-diagnostic · outer cargo testКачество данных: complete · Варианты среды: 1 · Первая запись: 2026-09-14 · Последнее наблюдение: 2026-09-14
-
наблюдалось PROJECT_COMPILE exit 101 E0277 ×1 1.0.47 os=linux quote::format_ident sha256:ab12e03ad4b1…error[E0277]: the trait bound `i32: IdentFragment` is not satisfiedrust/rustc · compiler-diagnostic · outer cargo runКачество данных: complete · Варианты среды: 1 · Первая запись: 2026-09-14 · Последнее наблюдение: 2026-09-14
-
наблюдалось PROJECT_COMPILE exit 101 ×1 1.0.47 os=linux quote::format_ident sha256:b53ce471a520…error: could not compile `test-quote` (lib) due to 1 previous error; 1 warning emittedrust/rustc · compiler-diagnostic · outer cargo testКачество данных: complete · Варианты среды: 1 · Первая запись: 2026-09-14 · Последнее наблюдение: 2026-09-14
-
наблюдалось PROJECT_TEST exit 101 ×1 1.0.47 os=linux quote::format_ident sha256:cc325a11570b…error: test failed, to rerun pass `--lib` · running 6 tests · test tests::test_quote_basic_tokens ... ok …rust/test · test-runner-diagnostic · outer cargo testКачество данных: complete · Варианты среды: 1 · Первая запись: 2026-09-14 · Последнее наблюдение: 2026-09-14
-
наблюдалось PROJECT_COMPILE exit 101 E0433 ×1 1.0.47 os=linux sha256:4cea35867957…error[E0433]: cannot find `__private229` in `_serde` · error[E0433]: cannot find `Serializer` in `_serde` · error[E0433]: cannot find `ser` in `_serde`rust/rustc · compiler-diagnostic · outer cargo checkКачество данных: complete · Варианты среды: 1 · Первая запись: 2026-09-14 · Последнее наблюдение: 2026-09-14
-
наблюдалось PROJECT_COMPILE exit 101 E0283 ×1 1.0.47 os=linux sha256:55052d6fc8b2…error[E0283]: type annotations neededrust/rustc · compiler-diagnostic · outer cargo runКачество данных: complete · Варианты среды: 1 · Первая запись: 2026-09-14 · Последнее наблюдение: 2026-09-14
-
наблюдалось PROJECT_COMPILE exit 101 ×1 1.0.47 os=linux sha256:7461bf46226d…error: could not compile `sample-serde-core` (bin <str>) due to 3 previous errorsrust/rustc · compiler-diagnostic · outer cargo runКачество данных: complete · Варианты среды: 1 · Первая запись: 2026-09-14 · Последнее наблюдение: 2026-09-14
-
наблюдалось PROJECT_COMPILE exit 101 E0405 ×1 1.0.47 os=linux sha256:8a1088019b07…error[E0405]: cannot find trait `Serialize` in module `_serde` · error[E0405]: cannot find trait `Serializer` in module `_serde`rust/rustc · compiler-diagnostic · outer cargo checkКачество данных: complete · Варианты среды: 1 · Первая запись: 2026-09-14 · Последнее наблюдение: 2026-09-14
-
наблюдалось PROJECT_COMPILE exit 101 ×1 1.0.47 os=linux sha256:b21c095b1aba…error: could not compile `sample-serde-core` (bin <str>) due to 1 previous errorrust/rustc · compiler-diagnostic · outer cargo runКачество данных: complete · Варианты среды: 1 · Первая запись: 2026-09-14 · Последнее наблюдение: 2026-09-14
-
наблюдалось PROJECT_COMPILE exit 101 ×1 1.0.47 os=linux sha256:df160d9ca814…error: could not compile `sample-serde-derive` (bin <str>) due to 7 previous errorsrust/rustc · compiler-diagnostic · outer cargo checkКачество данных: complete · Варианты среды: 1 · Первая запись: 2026-09-14 · Последнее наблюдение: 2026-09-14
-
наблюдалось PROJECT_COMPILE exit 101 E0599 ×1 1.0.47 os=linux sha256:f713b890152f…error[E0599]: no method named `into_deserializer` found for enum `std::option::Option<T>` in the current scope …rust/rustc · compiler-diagnostic · outer cargo runКачество данных: complete · Варианты среды: 1 · Первая запись: 2026-09-14 · Последнее наблюдение: 2026-09-14
Показаны 12 наиболее часто сообщаемых из 18 записанных кластеров отказов. Остальные — единичные сообщения.