Aufzeichnungencargoquote1.0.47quote::format_ident
Veröffentlichte Beispiele
- quote 1.0.47: quote::format_ident Dieses Netzwerk bietet eine Sache: ein Sample, das baut. Es hat es in einer Sandbox ausgeführt und die signierte Quittung behalten. Es bewertet nichts und garantiert nichts — ob derselbe Code bei Ihnen baut, hat es nicht gemessen. HOWquote::format_ident MIT-0 · 2026-09-14
Kompatibilitätsmatrix
Beobachtungen auf Projektebene und Symbol-/Contract-Verifizierungen werden getrennt gezählt und niemals zusammengerechnet.
Diese Zahlen unterscheiden nicht, wie das Symbol aufgerufen wurde: Überladungen, Argumentformen und Optionen werden zusammengefasst. Was eine bestimmte Aufrufform tut, beweist der Vertrag eines Samples – nicht diese Zahlen.
| Umgebung | Konfidenz | Beobachtungen | Verifiziert | Erfolgsquote | Peers | Zuletzt gesehen |
|---|---|---|---|---|---|---|
| unknown · Rust · cargo · linux glibc
Beobachtungen: PROJECT_COMPILE 0✓ 4✕ · PROJECT_PROCESS 3✓ · PROJECT_TEST 2✓ 1✕
|
ELEVATED FAILURE | 10 | 0 | 50 % | 1 | 2026-09-14 |
| rust 1 · Rust · cargo · linux musl · docker
Beobachtungen: PROJECT_TEST 2✓ — Verifiziert: CONTRACT 1✓
|
LOW | 2 | 1 | 100 % | 1 · 1✓ | 2026-09-17 |
snapshot · 2026-09-17
Fehler-Cluster
-
beobachtet PROJECT_COMPILE exit 101 ×1 1.0.47 os=linux quote::format_ident sha256:0d5a8e2ccc86…error: could not compile `quote-test` (bin <str>) due to 1 previous error; 1 warning emittedrust/rustc · compiler-diagnostic · outer cargo runBeweisqualität: complete · Umgebungsvarianten: 1 · Zuerst erfasst: 2026-09-14 · Zuletzt gesehen: 2026-09-14
-
beobachtet PROJECT_COMPILE exit 101 E0432 ×1 1.0.47 os=linux quote::format_ident sha256:4a6dd64b7a9b…error[E0432]: unresolved import `proc_macro2`rust/rustc · compiler-diagnostic · outer cargo testBeweisqualität: complete · Umgebungsvarianten: 1 · Zuerst erfasst: 2026-09-14 · Zuletzt gesehen: 2026-09-14
-
beobachtet PROJECT_COMPILE exit 101 E0277 ×1 1.0.47 os=linux quote::format_ident sha256:ab12e03ad4b1…error[E0277]: the trait bound `i32: IdentFragment` is not satisfiedrust/rustc · compiler-diagnostic · outer cargo runBeweisqualität: complete · Umgebungsvarianten: 1 · Zuerst erfasst: 2026-09-14 · Zuletzt gesehen: 2026-09-14
-
beobachtet PROJECT_COMPILE exit 101 ×1 1.0.47 os=linux quote::format_ident sha256:b53ce471a520…error: could not compile `test-quote` (lib) due to 1 previous error; 1 warning emittedrust/rustc · compiler-diagnostic · outer cargo testBeweisqualität: complete · Umgebungsvarianten: 1 · Zuerst erfasst: 2026-09-14 · Zuletzt gesehen: 2026-09-14
-
beobachtet PROJECT_TEST exit 101 ×1 1.0.47 os=linux quote::format_ident sha256:cc325a11570b…error: test failed, to rerun pass `--lib` · running 6 tests · test tests::test_quote_basic_tokens ... ok …rust/test · test-runner-diagnostic · outer cargo testBeweisqualität: complete · Umgebungsvarianten: 1 · Zuerst erfasst: 2026-09-14 · Zuletzt gesehen: 2026-09-14
-
beobachtet PROJECT_COMPILE exit 101 E0433 ×1 1.0.47 os=linux sha256:4cea35867957…error[E0433]: cannot find `__private229` in `_serde` · error[E0433]: cannot find `Serializer` in `_serde` · error[E0433]: cannot find `ser` in `_serde`rust/rustc · compiler-diagnostic · outer cargo checkBeweisqualität: complete · Umgebungsvarianten: 1 · Zuerst erfasst: 2026-09-14 · Zuletzt gesehen: 2026-09-14
-
beobachtet PROJECT_COMPILE exit 101 E0283 ×1 1.0.47 os=linux sha256:55052d6fc8b2…error[E0283]: type annotations neededrust/rustc · compiler-diagnostic · outer cargo runBeweisqualität: complete · Umgebungsvarianten: 1 · Zuerst erfasst: 2026-09-14 · Zuletzt gesehen: 2026-09-14
-
beobachtet PROJECT_COMPILE exit 101 ×1 1.0.47 os=linux sha256:7461bf46226d…error: could not compile `sample-serde-core` (bin <str>) due to 3 previous errorsrust/rustc · compiler-diagnostic · outer cargo runBeweisqualität: complete · Umgebungsvarianten: 1 · Zuerst erfasst: 2026-09-14 · Zuletzt gesehen: 2026-09-14
-
beobachtet PROJECT_COMPILE exit 101 E0405 ×1 1.0.47 os=linux sha256:8a1088019b07…error[E0405]: cannot find trait `Serialize` in module `_serde` · error[E0405]: cannot find trait `Serializer` in module `_serde`rust/rustc · compiler-diagnostic · outer cargo checkBeweisqualität: complete · Umgebungsvarianten: 1 · Zuerst erfasst: 2026-09-14 · Zuletzt gesehen: 2026-09-14
-
beobachtet PROJECT_COMPILE exit 101 ×1 1.0.47 os=linux sha256:b21c095b1aba…error: could not compile `sample-serde-core` (bin <str>) due to 1 previous errorrust/rustc · compiler-diagnostic · outer cargo runBeweisqualität: complete · Umgebungsvarianten: 1 · Zuerst erfasst: 2026-09-14 · Zuletzt gesehen: 2026-09-14
-
beobachtet PROJECT_COMPILE exit 101 ×1 1.0.47 os=linux sha256:df160d9ca814…error: could not compile `sample-serde-derive` (bin <str>) due to 7 previous errorsrust/rustc · compiler-diagnostic · outer cargo checkBeweisqualität: complete · Umgebungsvarianten: 1 · Zuerst erfasst: 2026-09-14 · Zuletzt gesehen: 2026-09-14
-
beobachtet PROJECT_COMPILE exit 101 E0599 ×1 1.0.47 os=linux sha256:f713b890152f…error[E0599]: no method named `into_deserializer` found for enum `std::option::Option<T>` in the current scope …rust/rustc · compiler-diagnostic · outer cargo runBeweisqualität: complete · Umgebungsvarianten: 1 · Zuerst erfasst: 2026-09-14 · Zuletzt gesehen: 2026-09-14
Es werden die 12 meistgemeldeten von 18 aufgezeichneten Fehlerclustern gezeigt. Der Rest sind Einzelmeldungen.