記録cargoquote1.0.47quote::format_ident
公開したサンプル
- quote 1.0.47: quote::format_ident このネットワークが提供するのは一つだけです。ビルドされるサンプル。サンドボックスで実行し、署名済みの受領証を保管します。等級はつけず、何も保証しません — 同じコードがあなたの環境でビルドされるかは測定していません。 HOWquote::format_ident MIT-0 · 2026-09-14
互換性マトリクス
プロジェクトレベルの観測とシンボル/コントラクト検証は別々に集計し、決して合算しません。
これらの数値は、シンボルがどう呼び出されたかを区別しません。オーバーロード、引数の形、オプションはまとめて集計されます。特定の呼び出し方がどう動くかは、この数値ではなくサンプルの契約が証明します。
| 環境 | 信頼度 | 観測 | 検証 | 成功率 | ピア | 最終観測 |
|---|---|---|---|---|---|---|
| unknown · Rust · cargo · linux glibc
観測: PROJECT_COMPILE 0✓ 4✕ · PROJECT_PROCESS 3✓ · PROJECT_TEST 2✓ 1✕
|
ELEVATED FAILURE | 10 | 0 | 50% | 1 | 2026-09-14 |
| rust 1 · Rust · cargo · linux musl · docker
観測: PROJECT_TEST 2✓ — 検証: CONTRACT 1✓
|
LOW | 2 | 1 | 100% | 1 · 1✓ | 2026-09-17 |
snapshot · 2026-09-17
失敗クラスター
-
観測済み PROJECT_COMPILE exit 101 ×1 1.0.47 os=linux quote::format_ident sha256:0d5a8e2ccc86…error: could not compile `quote-test` (bin <str>) due to 1 previous error; 1 warning emittedrust/rustc · compiler-diagnostic · outer cargo run証拠品質: complete · 環境バリアント: 1 · 初回記録: 2026-09-14 · 最終観測: 2026-09-14
-
観測済み PROJECT_COMPILE exit 101 E0432 ×1 1.0.47 os=linux quote::format_ident sha256:4a6dd64b7a9b…error[E0432]: unresolved import `proc_macro2`rust/rustc · compiler-diagnostic · outer cargo test証拠品質: complete · 環境バリアント: 1 · 初回記録: 2026-09-14 · 最終観測: 2026-09-14
-
観測済み PROJECT_COMPILE exit 101 E0277 ×1 1.0.47 os=linux quote::format_ident sha256:ab12e03ad4b1…error[E0277]: the trait bound `i32: IdentFragment` is not satisfiedrust/rustc · compiler-diagnostic · outer cargo run証拠品質: complete · 環境バリアント: 1 · 初回記録: 2026-09-14 · 最終観測: 2026-09-14
-
観測済み PROJECT_COMPILE exit 101 ×1 1.0.47 os=linux quote::format_ident sha256:b53ce471a520…error: could not compile `test-quote` (lib) due to 1 previous error; 1 warning emittedrust/rustc · compiler-diagnostic · outer cargo test証拠品質: complete · 環境バリアント: 1 · 初回記録: 2026-09-14 · 最終観測: 2026-09-14
-
観測済み PROJECT_TEST exit 101 ×1 1.0.47 os=linux quote::format_ident sha256:cc325a11570b…error: test failed, to rerun pass `--lib` · running 6 tests · test tests::test_quote_basic_tokens ... ok …rust/test · test-runner-diagnostic · outer cargo test証拠品質: complete · 環境バリアント: 1 · 初回記録: 2026-09-14 · 最終観測: 2026-09-14
-
観測済み PROJECT_COMPILE exit 101 E0433 ×1 1.0.47 os=linux sha256:4cea35867957…error[E0433]: cannot find `__private229` in `_serde` · error[E0433]: cannot find `Serializer` in `_serde` · error[E0433]: cannot find `ser` in `_serde`rust/rustc · compiler-diagnostic · outer cargo check証拠品質: complete · 環境バリアント: 1 · 初回記録: 2026-09-14 · 最終観測: 2026-09-14
-
観測済み PROJECT_COMPILE exit 101 E0283 ×1 1.0.47 os=linux sha256:55052d6fc8b2…error[E0283]: type annotations neededrust/rustc · compiler-diagnostic · outer cargo run証拠品質: complete · 環境バリアント: 1 · 初回記録: 2026-09-14 · 最終観測: 2026-09-14
-
観測済み PROJECT_COMPILE exit 101 ×1 1.0.47 os=linux sha256:7461bf46226d…error: could not compile `sample-serde-core` (bin <str>) due to 3 previous errorsrust/rustc · compiler-diagnostic · outer cargo run証拠品質: complete · 環境バリアント: 1 · 初回記録: 2026-09-14 · 最終観測: 2026-09-14
-
観測済み PROJECT_COMPILE exit 101 E0405 ×1 1.0.47 os=linux sha256:8a1088019b07…error[E0405]: cannot find trait `Serialize` in module `_serde` · error[E0405]: cannot find trait `Serializer` in module `_serde`rust/rustc · compiler-diagnostic · outer cargo check証拠品質: complete · 環境バリアント: 1 · 初回記録: 2026-09-14 · 最終観測: 2026-09-14
-
観測済み PROJECT_COMPILE exit 101 ×1 1.0.47 os=linux sha256:b21c095b1aba…error: could not compile `sample-serde-core` (bin <str>) due to 1 previous errorrust/rustc · compiler-diagnostic · outer cargo run証拠品質: complete · 環境バリアント: 1 · 初回記録: 2026-09-14 · 最終観測: 2026-09-14
-
観測済み PROJECT_COMPILE exit 101 ×1 1.0.47 os=linux sha256:df160d9ca814…error: could not compile `sample-serde-derive` (bin <str>) due to 7 previous errorsrust/rustc · compiler-diagnostic · outer cargo check証拠品質: complete · 環境バリアント: 1 · 初回記録: 2026-09-14 · 最終観測: 2026-09-14
-
観測済み PROJECT_COMPILE exit 101 E0599 ×1 1.0.47 os=linux sha256:f713b890152f…error[E0599]: no method named `into_deserializer` found for enum `std::option::Option<T>` in the current scope …rust/rustc · compiler-diagnostic · outer cargo run証拠品質: complete · 環境バリアント: 1 · 初回記録: 2026-09-14 · 最終観測: 2026-09-14
最も多く報告された 12 件を表示しています。この座標に記録された失敗クラスタは 18 件です。残りは単発の報告です。