Записиcargomime0.3.17
Детали окружения
Наблюдения уровня проекта и проверки символов/контрактов считаются раздельно и никогда не суммируются.
Эти числа не различают, как именно был вызван символ: перегрузки, наборы аргументов и опции считаются вместе. Что делает конкретная форма вызова, доказывает контракт образца, а не эти цифры.
| Окружение | Достоверность | Наблюдения | Проверено | Доля успешных | Пиры | Последнее наблюдение |
|---|---|---|---|---|---|---|
| unknown · Rust · cargo · linux glibc
Наблюдения: PROJECT_COMPILE 1✓ 5✕ · PROJECT_PROCESS 11✓
|
ELEVATED FAILURE | 17 | 0 | 71 % | 1 | 2026-09-19 |
Недавние кластеры сбоев
-
наблюдалось PROJECT_COMPILE exit 101 E0603 ×1 0.3.17 os=linux sha256:5200eda42d99…error[E0603]: module `error` is privaterust/rustc · compiler-diagnostic · outer cargo runКачество данных: complete · Варианты среды: 1 · Первая запись: 2026-09-19 · Последнее наблюдение: 2026-09-19
-
наблюдалось PROJECT_COMPILE exit 101 E0433 ×1 0.3.17 os=linux sha256:addfa6ed2041…error[E0433]: cannot find module or crate `http` in this scoperust/rustc · compiler-diagnostic · outer cargo runКачество данных: complete · Варианты среды: 1 · Первая запись: 2026-09-19 · Последнее наблюдение: 2026-09-19
-
наблюдалось PROJECT_COMPILE exit 101 ×1 0.3.17 os=linux sha256:b35018818384…error: could not compile `axum-core-check` (bin <str>) due to 3 previous errorsrust/rustc · compiler-diagnostic · outer cargo runКачество данных: complete · Варианты среды: 1 · Первая запись: 2026-09-19 · Последнее наблюдение: 2026-09-19
-
наблюдалось PROJECT_COMPILE exit 101 ×1 0.3.17 os=linux sha256:c429d449c2dc…error: could not compile `axum-core-check` (bin <str>) due to 1 previous errorrust/rustc · compiler-diagnostic · outer cargo runКачество данных: complete · Варианты среды: 1 · Первая запись: 2026-09-19 · Последнее наблюдение: 2026-09-19
-
наблюдалось PROJECT_COMPILE exit 101 E0624 ×1 0.3.17 os=linux sha256:d32d1a8dc0f3…error[E0624]: associated function `from_err` is privaterust/rustc · compiler-diagnostic · outer cargo runКачество данных: complete · Варианты среды: 1 · Первая запись: 2026-09-19 · Последнее наблюдение: 2026-09-19
Символы
Пока нет символов со свидетельствами.