Registroscargomime0.3.17
Detalle del entorno
Las observaciones a nivel de proyecto y las verificaciones de símbolo/contrato se cuentan por separado y nunca se combinan.
Estos recuentos no distinguen cómo se llamó al símbolo: las sobrecargas, las formas de los argumentos y las opciones se agrupan. Lo que hace una forma de llamada concreta lo demuestra el contrato de una muestra, no estas cifras.
| Entorno | Confianza | Observaciones | Verificado | Tasa de éxito | Pares | Última observación |
|---|---|---|---|---|---|---|
| unknown · Rust · cargo · linux glibc
Observaciones: PROJECT_COMPILE 1✓ 5✕ · PROJECT_PROCESS 11✓
|
ELEVATED FAILURE | 17 | 0 | 71% | 1 | 2026-09-19 |
Clústeres de fallos recientes
-
observado PROJECT_COMPILE exit 101 E0603 ×1 0.3.17 os=linux sha256:5200eda42d99…error[E0603]: module `error` is privaterust/rustc · compiler-diagnostic · outer cargo runCalidad de evidencia: complete · Variantes de entorno: 1 · Primer registro: 2026-09-19 · Última observación: 2026-09-19
-
observado PROJECT_COMPILE exit 101 E0433 ×1 0.3.17 os=linux sha256:addfa6ed2041…error[E0433]: cannot find module or crate `http` in this scoperust/rustc · compiler-diagnostic · outer cargo runCalidad de evidencia: complete · Variantes de entorno: 1 · Primer registro: 2026-09-19 · Última observación: 2026-09-19
-
observado PROJECT_COMPILE exit 101 ×1 0.3.17 os=linux sha256:b35018818384…error: could not compile `axum-core-check` (bin <str>) due to 3 previous errorsrust/rustc · compiler-diagnostic · outer cargo runCalidad de evidencia: complete · Variantes de entorno: 1 · Primer registro: 2026-09-19 · Última observación: 2026-09-19
-
observado PROJECT_COMPILE exit 101 ×1 0.3.17 os=linux sha256:c429d449c2dc…error: could not compile `axum-core-check` (bin <str>) due to 1 previous errorrust/rustc · compiler-diagnostic · outer cargo runCalidad de evidencia: complete · Variantes de entorno: 1 · Primer registro: 2026-09-19 · Última observación: 2026-09-19
-
observado PROJECT_COMPILE exit 101 E0624 ×1 0.3.17 os=linux sha256:d32d1a8dc0f3…error[E0624]: associated function `from_err` is privaterust/rustc · compiler-diagnostic · outer cargo runCalidad de evidencia: complete · Variantes de entorno: 1 · Primer registro: 2026-09-19 · Última observación: 2026-09-19
Símbolos
Aún no hay símbolos con evidencia.