Registroscargomime0.3.17
Detalhe do ambiente
Observações no nível do projeto e verificações de símbolo/contrato são contadas separadamente e nunca somadas.
Estas contagens não distinguem como o símbolo foi chamado: sobrecargas, formatos de argumentos e opções são agrupados. O que uma forma de chamada específica faz é provado pelo contrato de uma amostra, não por estes números.
| Ambiente | Confiança | Observações | Verificado | Taxa de aprovação | Peers | Visto por último |
|---|---|---|---|---|---|---|
| unknown · Rust · cargo · linux glibc
Observações: PROJECT_COMPILE 1✓ 5✕ · PROJECT_PROCESS 11✓
|
ELEVATED FAILURE | 17 | 0 | 71% | 1 | 2026-09-19 |
Clusters de falha recentes
-
observado PROJECT_COMPILE exit 101 E0603 ×1 0.3.17 os=linux sha256:5200eda42d99…error[E0603]: module `error` is privaterust/rustc · compiler-diagnostic · outer cargo runQualidade da evidência: complete · Variantes de ambiente: 1 · Primeiro registro: 2026-09-19 · Visto por último: 2026-09-19
-
observado PROJECT_COMPILE exit 101 E0433 ×1 0.3.17 os=linux sha256:addfa6ed2041…error[E0433]: cannot find module or crate `http` in this scoperust/rustc · compiler-diagnostic · outer cargo runQualidade da evidência: complete · Variantes de ambiente: 1 · Primeiro registro: 2026-09-19 · Visto por último: 2026-09-19
-
observado PROJECT_COMPILE exit 101 ×1 0.3.17 os=linux sha256:b35018818384…error: could not compile `axum-core-check` (bin <str>) due to 3 previous errorsrust/rustc · compiler-diagnostic · outer cargo runQualidade da evidência: complete · Variantes de ambiente: 1 · Primeiro registro: 2026-09-19 · Visto por último: 2026-09-19
-
observado PROJECT_COMPILE exit 101 ×1 0.3.17 os=linux sha256:c429d449c2dc…error: could not compile `axum-core-check` (bin <str>) due to 1 previous errorrust/rustc · compiler-diagnostic · outer cargo runQualidade da evidência: complete · Variantes de ambiente: 1 · Primeiro registro: 2026-09-19 · Visto por último: 2026-09-19
-
observado PROJECT_COMPILE exit 101 E0624 ×1 0.3.17 os=linux sha256:d32d1a8dc0f3…error[E0624]: associated function `from_err` is privaterust/rustc · compiler-diagnostic · outer cargo runQualidade da evidência: complete · Variantes de ambiente: 1 · Primeiro registro: 2026-09-19 · Visto por último: 2026-09-19
Símbolos
Ainda não há símbolos com evidências.