记录npmzod3.25.76zod.ZodSchema
兼容性矩阵
项目级观测与符号/契约验证分别统计,绝不合并。
这些计数不区分符号的调用方式:重载、参数形态和选项被合并统计。某一具体调用方式的行为由样本的契约证明,而不是由这些数字证明。
| 环境 | 置信度 | 观测 | 验证 | 通过率 | 节点 | 最近观测 |
|---|---|---|---|---|---|---|
| node 24.13 · TS · npm · windows
观测: PROJECT_COMPILE 0✓ 48✕ · PROJECT_PROCESS 11✓ · PROJECT_TEST 1✓ · PROJECT_TYPECHECK 8✓ — 验证: UNKNOWN 0✓ 9✕
|
ELEVATED FAILURE | 68 | 9 | 26% | 1 | 2026-09-16 |
snapshot · 2026-09-17
失败聚类
-
已观测 UNKNOWN exit 1 ERR_PNPM_RECURSIVE_RUN_FIRST_FAIL 证据缺口 ×31 3.25.76 executionContext=node · moduleSystem=esm · os=windows · runtime=node@24.13 sha256:9f91c9753081…(node:<n>) ExperimentalWarning: SQLite is an experimental feature and might change at any time …pnpm · unclassified-diagnostic · outer pnpm · gap stage-unknown证据质量: complete · 环境变体: 1 · 首次记录: 2026-09-01 · 最近观测: 2026-09-15诊断复验候选
-
已观测 UNKNOWN exit 1 ERR_PNPM_RECURSIVE_EXEC_FIRST_FAIL 证据缺口 ×28 3.25.76 executionContext=node · moduleSystem=esm · os=windows · runtime=node@24.13 sha256:979755e6489d…(node:<n>) ExperimentalWarning: SQLite is an experimental feature and might change at any time …pnpm · unclassified-diagnostic · outer pnpm · gap stage-unknown证据质量: complete · 环境变体: 1 · 首次记录: 2026-09-01 · 最近观测: 2026-09-15诊断复验候选
-
已观测 PROJECT_PROCESS ERR_MODULE_NOT_FOUND 证据缺口 ×16 3.25.76 → 4.1.12 → 4.4.3 executionContext=node证据质量: legacy-evidence-incomplete · 环境变体: 3 · 首次记录: 2026-08-13 · 最近观测: 2026-08-29诊断复验候选
-
已观测 UNKNOWN exit 1 ERR_PNPM_RECURSIVE_EXEC_FIRST_FAIL 证据缺口 ×11 3.25.76 executionContext=node · moduleSystem=esm · os=windows · runtime=node@24.13 sha256:73873d2c4aed…<str> is not recognized as an internal or external command, · operable program or batch file. · undefined …pnpm · unclassified-diagnostic · outer pnpm · gap stage-unknown证据质量: complete · 环境变体: 1 · 首次记录: 2026-09-01 · 最近观测: 2026-09-01诊断复验候选
-
已观测 PROJECT_TEST exit 1 ELIFECYCLE ×10 3.25.76 executionContext=node · moduleSystem=esm · os=windows · runtime=node@24.13 sha256:7711694d48fa…ELIFECYCLE Test failed. See above for more details.javascript/test-runner · test-runner-diagnostic · outer pnpm test证据质量: complete · 环境变体: 1 · 首次记录: 2026-08-29 · 最近观测: 2026-09-01
-
已观测 UNKNOWN exit 1 ELIFECYCLE 证据缺口 ×7 3.25.76 executionContext=node · moduleSystem=esm · os=windows · runtime=node@24.13 sha256:f398b989dbea…> devhotel-workspace@0.4.3 lint <path> · > eslint . · <path> …pnpm · unclassified-diagnostic · outer pnpm · gap stage-unknown证据质量: complete · 环境变体: 1 · 首次记录: 2026-09-01 · 最近观测: 2026-09-01诊断复验候选
-
已观测 UNKNOWN exit 1 ERR_PNPM_RECURSIVE_RUN_FIRST_FAIL 证据缺口 ×5 3.25.76 executionContext=node · moduleSystem=esm · os=windows · runtime=node@24.13 sha256:0c4a78e30813…> devhotel-workspace@0.5.2 typecheck <path> · > pnpm -r typecheck · Scope: 4 of 5 workspace projects · packages/shared typecheck$ tsc --noEmitpnpm · unclassified-diagnostic · outer pnpm · gap stage-unknown证据质量: complete · 环境变体: 1 · 首次记录: 2026-09-13 · 最近观测: 2026-09-13诊断复验候选
-
已观测 PROJECT_TEST ENOENT 证据缺口 ×4 3.23.8 → 3.25.76 executionContext=node · os=windows · runtime=node@24.13证据质量: legacy-evidence-incomplete · 环境变体: 3 · 首次记录: 2026-08-17 · 最近观测: 2026-08-25诊断复验候选
-
已观测 UNKNOWN exit 1 ERR_PNPM_RECURSIVE_EXEC_FIRST_FAIL 证据缺口 ×4 3.25.76 executionContext=node · moduleSystem=esm · os=windows · runtime=node@24.13 sha256:d53178e9c23b…<str> is not recognized as an internal or external command, · operable program or batch file. · undefined · <path>pnpm · unclassified-diagnostic · outer pnpm · gap stage-unknown证据质量: complete · 环境变体: 1 · 首次记录: 2026-08-29 · 最近观测: 2026-09-15诊断复验候选
-
已观测 UNKNOWN exit 1 ERR_PNPM_RECURSIVE_RUN_FIRST_FAIL 证据缺口 ×4 3.25.76 executionContext=node · moduleSystem=esm · os=windows · runtime=node@24.13 sha256:3b99548df64e…> devhotel-workspace@0.4.3 typecheck <path> · > pnpm -r typecheck · Scope: 4 of 5 workspace projects · packages/shared typecheck$ tsc --noEmitpnpm · unclassified-diagnostic · outer pnpm · gap stage-unknown证据质量: complete · 环境变体: 1 · 首次记录: 2026-09-01 · 最近观测: 2026-09-01诊断复验候选
-
已观测 PROJECT_COMPILE exit 2 TS2307 ×4 3.25.76 executionContext=node · moduleSystem=cjs · os=windows · runtime=node@24.13 zod.ZodSchema sha256:0470f88d95bb…lib/hooks/queries/index.ts(<n>,<n>): error TS2307: Cannot find module <str> or its corresponding type declarations. …typescript/tsc · compiler-diagnostic证据质量: complete · 环境变体: 1 · 首次记录: 2026-09-01 · 最近观测: 2026-09-01
-
已观测 PROJECT_COMPILE exit 2 TS7006 ×4 3.25.76 executionContext=node · moduleSystem=cjs · os=windows · runtime=node@24.13 zod.ZodSchema sha256:21025cd78572…app/api/politicians/[id]/real-estates/route.ts(<n>,<n>): error TS7006: Parameter <str> implicitly has an <str> type. …typescript/tsc · compiler-diagnostic证据质量: complete · 环境变体: 1 · 首次记录: 2026-09-01 · 最近观测: 2026-09-01
显示报告最多的 12 个。此坐标记录的失败聚类共 189 个。其余为单次报告。