記録npmzod3.25.76zod.ZodSchema
互換性マトリクス
プロジェクトレベルの観測とシンボル/コントラクト検証は別々に集計し、決して合算しません。
これらの数値は、シンボルがどう呼び出されたかを区別しません。オーバーロード、引数の形、オプションはまとめて集計されます。特定の呼び出し方がどう動くかは、この数値ではなくサンプルの契約が証明します。
| 環境 | 信頼度 | 観測 | 検証 | 成功率 | ピア | 最終観測 |
|---|---|---|---|---|---|---|
| node 24.13 · TS · npm · windows
観測: PROJECT_COMPILE 0✓ 48✕ · PROJECT_PROCESS 11✓ · PROJECT_TEST 1✓ · PROJECT_TYPECHECK 8✓ — 検証: UNKNOWN 0✓ 9✕
|
ELEVATED FAILURE | 68 | 9 | 26% | 1 | 2026-09-16 |
snapshot · 2026-09-17
失敗クラスター
-
観測済み UNKNOWN exit 1 ERR_PNPM_RECURSIVE_RUN_FIRST_FAIL 証拠の欠落 ×31 3.25.76 executionContext=node · moduleSystem=esm · os=windows · runtime=node@24.13 sha256:9f91c9753081…(node:<n>) ExperimentalWarning: SQLite is an experimental feature and might change at any time …pnpm · unclassified-diagnostic · outer pnpm · gap stage-unknown証拠品質: complete · 環境バリアント: 1 · 初回記録: 2026-09-01 · 最終観測: 2026-09-15診断再検証候補
-
観測済み UNKNOWN exit 1 ERR_PNPM_RECURSIVE_EXEC_FIRST_FAIL 証拠の欠落 ×28 3.25.76 executionContext=node · moduleSystem=esm · os=windows · runtime=node@24.13 sha256:979755e6489d…(node:<n>) ExperimentalWarning: SQLite is an experimental feature and might change at any time …pnpm · unclassified-diagnostic · outer pnpm · gap stage-unknown証拠品質: complete · 環境バリアント: 1 · 初回記録: 2026-09-01 · 最終観測: 2026-09-15診断再検証候補
-
観測済み PROJECT_PROCESS ERR_MODULE_NOT_FOUND 証拠の欠落 ×16 3.25.76 → 4.1.12 → 4.4.3 executionContext=node証拠品質: legacy-evidence-incomplete · 環境バリアント: 3 · 初回記録: 2026-08-13 · 最終観測: 2026-08-29診断再検証候補
-
観測済み UNKNOWN exit 1 ERR_PNPM_RECURSIVE_EXEC_FIRST_FAIL 証拠の欠落 ×11 3.25.76 executionContext=node · moduleSystem=esm · os=windows · runtime=node@24.13 sha256:73873d2c4aed…<str> is not recognized as an internal or external command, · operable program or batch file. · undefined …pnpm · unclassified-diagnostic · outer pnpm · gap stage-unknown証拠品質: complete · 環境バリアント: 1 · 初回記録: 2026-09-01 · 最終観測: 2026-09-01診断再検証候補
-
観測済み PROJECT_TEST exit 1 ELIFECYCLE ×10 3.25.76 executionContext=node · moduleSystem=esm · os=windows · runtime=node@24.13 sha256:7711694d48fa…ELIFECYCLE Test failed. See above for more details.javascript/test-runner · test-runner-diagnostic · outer pnpm test証拠品質: complete · 環境バリアント: 1 · 初回記録: 2026-08-29 · 最終観測: 2026-09-01
-
観測済み UNKNOWN exit 1 ELIFECYCLE 証拠の欠落 ×7 3.25.76 executionContext=node · moduleSystem=esm · os=windows · runtime=node@24.13 sha256:f398b989dbea…> devhotel-workspace@0.4.3 lint <path> · > eslint . · <path> …pnpm · unclassified-diagnostic · outer pnpm · gap stage-unknown証拠品質: complete · 環境バリアント: 1 · 初回記録: 2026-09-01 · 最終観測: 2026-09-01診断再検証候補
-
観測済み UNKNOWN exit 1 ERR_PNPM_RECURSIVE_RUN_FIRST_FAIL 証拠の欠落 ×5 3.25.76 executionContext=node · moduleSystem=esm · os=windows · runtime=node@24.13 sha256:0c4a78e30813…> devhotel-workspace@0.5.2 typecheck <path> · > pnpm -r typecheck · Scope: 4 of 5 workspace projects · packages/shared typecheck$ tsc --noEmitpnpm · unclassified-diagnostic · outer pnpm · gap stage-unknown証拠品質: complete · 環境バリアント: 1 · 初回記録: 2026-09-13 · 最終観測: 2026-09-13診断再検証候補
-
観測済み PROJECT_TEST ENOENT 証拠の欠落 ×4 3.23.8 → 3.25.76 executionContext=node · os=windows · runtime=node@24.13証拠品質: legacy-evidence-incomplete · 環境バリアント: 3 · 初回記録: 2026-08-17 · 最終観測: 2026-08-25診断再検証候補
-
観測済み UNKNOWN exit 1 ERR_PNPM_RECURSIVE_EXEC_FIRST_FAIL 証拠の欠落 ×4 3.25.76 executionContext=node · moduleSystem=esm · os=windows · runtime=node@24.13 sha256:d53178e9c23b…<str> is not recognized as an internal or external command, · operable program or batch file. · undefined · <path>pnpm · unclassified-diagnostic · outer pnpm · gap stage-unknown証拠品質: complete · 環境バリアント: 1 · 初回記録: 2026-08-29 · 最終観測: 2026-09-15診断再検証候補
-
観測済み UNKNOWN exit 1 ERR_PNPM_RECURSIVE_RUN_FIRST_FAIL 証拠の欠落 ×4 3.25.76 executionContext=node · moduleSystem=esm · os=windows · runtime=node@24.13 sha256:3b99548df64e…> devhotel-workspace@0.4.3 typecheck <path> · > pnpm -r typecheck · Scope: 4 of 5 workspace projects · packages/shared typecheck$ tsc --noEmitpnpm · unclassified-diagnostic · outer pnpm · gap stage-unknown証拠品質: complete · 環境バリアント: 1 · 初回記録: 2026-09-01 · 最終観測: 2026-09-01診断再検証候補
-
観測済み PROJECT_COMPILE exit 2 TS2307 ×4 3.25.76 executionContext=node · moduleSystem=cjs · os=windows · runtime=node@24.13 zod.ZodSchema sha256:0470f88d95bb…lib/hooks/queries/index.ts(<n>,<n>): error TS2307: Cannot find module <str> or its corresponding type declarations. …typescript/tsc · compiler-diagnostic証拠品質: complete · 環境バリアント: 1 · 初回記録: 2026-09-01 · 最終観測: 2026-09-01
-
観測済み PROJECT_COMPILE exit 2 TS7006 ×4 3.25.76 executionContext=node · moduleSystem=cjs · os=windows · runtime=node@24.13 zod.ZodSchema sha256:21025cd78572…app/api/politicians/[id]/real-estates/route.ts(<n>,<n>): error TS7006: Parameter <str> implicitly has an <str> type. …typescript/tsc · compiler-diagnostic証拠品質: complete · 環境バリアント: 1 · 初回記録: 2026-09-01 · 最終観測: 2026-09-01
最も多く報告された 12 件を表示しています。この座標に記録された失敗クラスタは 189 件です。残りは単発の報告です。