Registrosnpmzod3.25.76zod.ZodError
Matriz de compatibilidade
Observações no nível do projeto e verificações de símbolo/contrato são contadas separadamente e nunca somadas.
Estas contagens não distinguem como o símbolo foi chamado: sobrecargas, formatos de argumentos e opções são agrupados. O que uma forma de chamada específica faz é provado pelo contrato de uma amostra, não por estes números.
| Ambiente | Confiança | Observações | Verificado | Taxa de aprovação | Peers | Visto por último |
|---|---|---|---|---|---|---|
| node 24.13 · TS · npm · windows
Observações: PROJECT_COMPILE 0✓ 48✕ · PROJECT_PROCESS 11✓ · PROJECT_TEST 1✓ · PROJECT_TYPECHECK 8✓ — Verificado: UNKNOWN 0✓ 9✕
|
ELEVATED FAILURE | 68 | 9 | 26% | 1 | 2026-09-16 |
snapshot · 2026-09-17
Clusters de falha
-
observado UNKNOWN exit 1 ERR_PNPM_RECURSIVE_RUN_FIRST_FAIL Lacuna de evidência ×31 3.25.76 executionContext=node · moduleSystem=esm · os=windows · runtime=node@24.13 sha256:9f91c9753081…(node:<n>) ExperimentalWarning: SQLite is an experimental feature and might change at any time …pnpm · unclassified-diagnostic · outer pnpm · gap stage-unknownQualidade da evidência: complete · Variantes de ambiente: 1 · Primeiro registro: 2026-09-01 · Visto por último: 2026-09-15Candidato a reverificação diagnóstica
-
observado UNKNOWN exit 1 ERR_PNPM_RECURSIVE_EXEC_FIRST_FAIL Lacuna de evidência ×28 3.25.76 executionContext=node · moduleSystem=esm · os=windows · runtime=node@24.13 sha256:979755e6489d…(node:<n>) ExperimentalWarning: SQLite is an experimental feature and might change at any time …pnpm · unclassified-diagnostic · outer pnpm · gap stage-unknownQualidade da evidência: complete · Variantes de ambiente: 1 · Primeiro registro: 2026-09-01 · Visto por último: 2026-09-15Candidato a reverificação diagnóstica
-
observado PROJECT_PROCESS ERR_MODULE_NOT_FOUND Lacuna de evidência ×16 3.25.76 → 4.1.12 → 4.4.3 executionContext=nodeQualidade da evidência: legacy-evidence-incomplete · Variantes de ambiente: 3 · Primeiro registro: 2026-08-13 · Visto por último: 2026-08-29Candidato a reverificação diagnóstica
-
observado UNKNOWN exit 1 ERR_PNPM_RECURSIVE_EXEC_FIRST_FAIL Lacuna de evidência ×11 3.25.76 executionContext=node · moduleSystem=esm · os=windows · runtime=node@24.13 sha256:73873d2c4aed…<str> is not recognized as an internal or external command, · operable program or batch file. · undefined …pnpm · unclassified-diagnostic · outer pnpm · gap stage-unknownQualidade da evidência: complete · Variantes de ambiente: 1 · Primeiro registro: 2026-09-01 · Visto por último: 2026-09-01Candidato a reverificação diagnóstica
-
observado PROJECT_TEST exit 1 ELIFECYCLE ×10 3.25.76 executionContext=node · moduleSystem=esm · os=windows · runtime=node@24.13 sha256:7711694d48fa…ELIFECYCLE Test failed. See above for more details.javascript/test-runner · test-runner-diagnostic · outer pnpm testQualidade da evidência: complete · Variantes de ambiente: 1 · Primeiro registro: 2026-08-29 · Visto por último: 2026-09-01
-
observado UNKNOWN exit 1 ELIFECYCLE Lacuna de evidência ×7 3.25.76 executionContext=node · moduleSystem=esm · os=windows · runtime=node@24.13 sha256:f398b989dbea…> devhotel-workspace@0.4.3 lint <path> · > eslint . · <path> …pnpm · unclassified-diagnostic · outer pnpm · gap stage-unknownQualidade da evidência: complete · Variantes de ambiente: 1 · Primeiro registro: 2026-09-01 · Visto por último: 2026-09-01Candidato a reverificação diagnóstica
-
observado UNKNOWN exit 1 ERR_PNPM_RECURSIVE_RUN_FIRST_FAIL Lacuna de evidência ×5 3.25.76 executionContext=node · moduleSystem=esm · os=windows · runtime=node@24.13 sha256:0c4a78e30813…> devhotel-workspace@0.5.2 typecheck <path> · > pnpm -r typecheck · Scope: 4 of 5 workspace projects · packages/shared typecheck$ tsc --noEmitpnpm · unclassified-diagnostic · outer pnpm · gap stage-unknownQualidade da evidência: complete · Variantes de ambiente: 1 · Primeiro registro: 2026-09-13 · Visto por último: 2026-09-13Candidato a reverificação diagnóstica
-
observado PROJECT_TEST ENOENT Lacuna de evidência ×4 3.23.8 → 3.25.76 executionContext=node · os=windows · runtime=node@24.13Qualidade da evidência: legacy-evidence-incomplete · Variantes de ambiente: 3 · Primeiro registro: 2026-08-17 · Visto por último: 2026-08-25Candidato a reverificação diagnóstica
-
observado UNKNOWN exit 1 ERR_PNPM_RECURSIVE_EXEC_FIRST_FAIL Lacuna de evidência ×4 3.25.76 executionContext=node · moduleSystem=esm · os=windows · runtime=node@24.13 sha256:d53178e9c23b…<str> is not recognized as an internal or external command, · operable program or batch file. · undefined · <path>pnpm · unclassified-diagnostic · outer pnpm · gap stage-unknownQualidade da evidência: complete · Variantes de ambiente: 1 · Primeiro registro: 2026-08-29 · Visto por último: 2026-09-15Candidato a reverificação diagnóstica
-
observado UNKNOWN exit 1 ERR_PNPM_RECURSIVE_RUN_FIRST_FAIL Lacuna de evidência ×4 3.25.76 executionContext=node · moduleSystem=esm · os=windows · runtime=node@24.13 sha256:3b99548df64e…> devhotel-workspace@0.4.3 typecheck <path> · > pnpm -r typecheck · Scope: 4 of 5 workspace projects · packages/shared typecheck$ tsc --noEmitpnpm · unclassified-diagnostic · outer pnpm · gap stage-unknownQualidade da evidência: complete · Variantes de ambiente: 1 · Primeiro registro: 2026-09-01 · Visto por último: 2026-09-01Candidato a reverificação diagnóstica
-
observado PROJECT_COMPILE exit 2 TS2307 ×4 3.25.76 executionContext=node · moduleSystem=cjs · os=windows · runtime=node@24.13 zod.ZodError sha256:0470f88d95bb…lib/hooks/queries/index.ts(<n>,<n>): error TS2307: Cannot find module <str> or its corresponding type declarations. …typescript/tsc · compiler-diagnosticQualidade da evidência: complete · Variantes de ambiente: 1 · Primeiro registro: 2026-09-01 · Visto por último: 2026-09-01
-
observado PROJECT_COMPILE exit 2 TS7006 ×4 3.25.76 executionContext=node · moduleSystem=cjs · os=windows · runtime=node@24.13 zod.ZodError sha256:21025cd78572…app/api/politicians/[id]/real-estates/route.ts(<n>,<n>): error TS7006: Parameter <str> implicitly has an <str> type. …typescript/tsc · compiler-diagnosticQualidade da evidência: complete · Variantes de ambiente: 1 · Primeiro registro: 2026-09-01 · Visto por último: 2026-09-01
Mostrando os 12 mais relatados de 189 grupos de falhas registrados. O resto são relatos únicos.