Aufzeichnungennpmzod3.25.76zod.ZodError
Kompatibilitätsmatrix
Beobachtungen auf Projektebene und Symbol-/Contract-Verifizierungen werden getrennt gezählt und niemals zusammengerechnet.
Diese Zahlen unterscheiden nicht, wie das Symbol aufgerufen wurde: Überladungen, Argumentformen und Optionen werden zusammengefasst. Was eine bestimmte Aufrufform tut, beweist der Vertrag eines Samples – nicht diese Zahlen.
| Umgebung | Konfidenz | Beobachtungen | Verifiziert | Erfolgsquote | Peers | Zuletzt gesehen |
|---|---|---|---|---|---|---|
| node 24.13 · TS · npm · windows
Beobachtungen: PROJECT_COMPILE 0✓ 48✕ · PROJECT_PROCESS 11✓ · PROJECT_TEST 1✓ · PROJECT_TYPECHECK 8✓ — Verifiziert: UNKNOWN 0✓ 9✕
|
ELEVATED FAILURE | 68 | 9 | 26 % | 1 | 2026-09-16 |
snapshot · 2026-09-17
Fehler-Cluster
-
beobachtet UNKNOWN exit 1 ERR_PNPM_RECURSIVE_RUN_FIRST_FAIL Beweislücke ×31 3.25.76 executionContext=node · moduleSystem=esm · os=windows · runtime=node@24.13 sha256:9f91c9753081…(node:<n>) ExperimentalWarning: SQLite is an experimental feature and might change at any time …pnpm · unclassified-diagnostic · outer pnpm · gap stage-unknownBeweisqualität: complete · Umgebungsvarianten: 1 · Zuerst erfasst: 2026-09-01 · Zuletzt gesehen: 2026-09-15Kandidat für diagnostische Neuprüfung
-
beobachtet UNKNOWN exit 1 ERR_PNPM_RECURSIVE_EXEC_FIRST_FAIL Beweislücke ×28 3.25.76 executionContext=node · moduleSystem=esm · os=windows · runtime=node@24.13 sha256:979755e6489d…(node:<n>) ExperimentalWarning: SQLite is an experimental feature and might change at any time …pnpm · unclassified-diagnostic · outer pnpm · gap stage-unknownBeweisqualität: complete · Umgebungsvarianten: 1 · Zuerst erfasst: 2026-09-01 · Zuletzt gesehen: 2026-09-15Kandidat für diagnostische Neuprüfung
-
beobachtet PROJECT_PROCESS ERR_MODULE_NOT_FOUND Beweislücke ×16 3.25.76 → 4.1.12 → 4.4.3 executionContext=nodeBeweisqualität: legacy-evidence-incomplete · Umgebungsvarianten: 3 · Zuerst erfasst: 2026-08-13 · Zuletzt gesehen: 2026-08-29Kandidat für diagnostische Neuprüfung
-
beobachtet UNKNOWN exit 1 ERR_PNPM_RECURSIVE_EXEC_FIRST_FAIL Beweislücke ×11 3.25.76 executionContext=node · moduleSystem=esm · os=windows · runtime=node@24.13 sha256:73873d2c4aed…<str> is not recognized as an internal or external command, · operable program or batch file. · undefined …pnpm · unclassified-diagnostic · outer pnpm · gap stage-unknownBeweisqualität: complete · Umgebungsvarianten: 1 · Zuerst erfasst: 2026-09-01 · Zuletzt gesehen: 2026-09-01Kandidat für diagnostische Neuprüfung
-
beobachtet PROJECT_TEST exit 1 ELIFECYCLE ×10 3.25.76 executionContext=node · moduleSystem=esm · os=windows · runtime=node@24.13 sha256:7711694d48fa…ELIFECYCLE Test failed. See above for more details.javascript/test-runner · test-runner-diagnostic · outer pnpm testBeweisqualität: complete · Umgebungsvarianten: 1 · Zuerst erfasst: 2026-08-29 · Zuletzt gesehen: 2026-09-01
-
beobachtet UNKNOWN exit 1 ELIFECYCLE Beweislücke ×7 3.25.76 executionContext=node · moduleSystem=esm · os=windows · runtime=node@24.13 sha256:f398b989dbea…> devhotel-workspace@0.4.3 lint <path> · > eslint . · <path> …pnpm · unclassified-diagnostic · outer pnpm · gap stage-unknownBeweisqualität: complete · Umgebungsvarianten: 1 · Zuerst erfasst: 2026-09-01 · Zuletzt gesehen: 2026-09-01Kandidat für diagnostische Neuprüfung
-
beobachtet UNKNOWN exit 1 ERR_PNPM_RECURSIVE_RUN_FIRST_FAIL Beweislücke ×5 3.25.76 executionContext=node · moduleSystem=esm · os=windows · runtime=node@24.13 sha256:0c4a78e30813…> devhotel-workspace@0.5.2 typecheck <path> · > pnpm -r typecheck · Scope: 4 of 5 workspace projects · packages/shared typecheck$ tsc --noEmitpnpm · unclassified-diagnostic · outer pnpm · gap stage-unknownBeweisqualität: complete · Umgebungsvarianten: 1 · Zuerst erfasst: 2026-09-13 · Zuletzt gesehen: 2026-09-13Kandidat für diagnostische Neuprüfung
-
beobachtet PROJECT_TEST ENOENT Beweislücke ×4 3.23.8 → 3.25.76 executionContext=node · os=windows · runtime=node@24.13Beweisqualität: legacy-evidence-incomplete · Umgebungsvarianten: 3 · Zuerst erfasst: 2026-08-17 · Zuletzt gesehen: 2026-08-25Kandidat für diagnostische Neuprüfung
-
beobachtet UNKNOWN exit 1 ERR_PNPM_RECURSIVE_EXEC_FIRST_FAIL Beweislücke ×4 3.25.76 executionContext=node · moduleSystem=esm · os=windows · runtime=node@24.13 sha256:d53178e9c23b…<str> is not recognized as an internal or external command, · operable program or batch file. · undefined · <path>pnpm · unclassified-diagnostic · outer pnpm · gap stage-unknownBeweisqualität: complete · Umgebungsvarianten: 1 · Zuerst erfasst: 2026-08-29 · Zuletzt gesehen: 2026-09-15Kandidat für diagnostische Neuprüfung
-
beobachtet UNKNOWN exit 1 ERR_PNPM_RECURSIVE_RUN_FIRST_FAIL Beweislücke ×4 3.25.76 executionContext=node · moduleSystem=esm · os=windows · runtime=node@24.13 sha256:3b99548df64e…> devhotel-workspace@0.4.3 typecheck <path> · > pnpm -r typecheck · Scope: 4 of 5 workspace projects · packages/shared typecheck$ tsc --noEmitpnpm · unclassified-diagnostic · outer pnpm · gap stage-unknownBeweisqualität: complete · Umgebungsvarianten: 1 · Zuerst erfasst: 2026-09-01 · Zuletzt gesehen: 2026-09-01Kandidat für diagnostische Neuprüfung
-
beobachtet PROJECT_COMPILE exit 2 TS2307 ×4 3.25.76 executionContext=node · moduleSystem=cjs · os=windows · runtime=node@24.13 zod.ZodError sha256:0470f88d95bb…lib/hooks/queries/index.ts(<n>,<n>): error TS2307: Cannot find module <str> or its corresponding type declarations. …typescript/tsc · compiler-diagnosticBeweisqualität: complete · Umgebungsvarianten: 1 · Zuerst erfasst: 2026-09-01 · Zuletzt gesehen: 2026-09-01
-
beobachtet PROJECT_COMPILE exit 2 TS7006 ×4 3.25.76 executionContext=node · moduleSystem=cjs · os=windows · runtime=node@24.13 zod.ZodError sha256:21025cd78572…app/api/politicians/[id]/real-estates/route.ts(<n>,<n>): error TS7006: Parameter <str> implicitly has an <str> type. …typescript/tsc · compiler-diagnosticBeweisqualität: complete · Umgebungsvarianten: 1 · Zuerst erfasst: 2026-09-01 · Zuletzt gesehen: 2026-09-01
Es werden die 12 meistgemeldeten von 189 aufgezeichneten Fehlerclustern gezeigt. Der Rest sind Einzelmeldungen.