记录npmws8.21.3ws.WebSocketServer
OS × 运行时一览
2○ 22026-09-07
如何阅读单元格: 数字是该比率所依据的已记录观测次数——一次构建每到达一个阶段就留下一条观测,因此它既不是构建数,也不是机器数或人数。旁边的文档是另一个来源不同的事实:该坐标是否有样例,以及我们在那里运行它的结果。
- 该坐标还没有样例
- 有样例 — 我们尚未在该坐标运行过它
- 有样例 — 我们在该坐标运行过,并且干净地结束
- 有样例 — 我们在该坐标运行过,并且失败了
- 有样例 — 该坐标同时记录了通过的和失败的运行
- 没有记录 — 未知,既非“可用”也非“损坏”
- 这一格下面还有层级 — 点击打开
有文档,就说明该坐标有样例。样例是否存在,是关于这个版本和这个 API 的事实,不随操作系统、运行时或包管理器改变;颜色说的是它在你正在看的那个环境里跑得怎么样。
已发布的示例
- ws 8.21.3: Distinguish ws package EventEmitter API and Buffer payloads from native WHATWG EventTarget WebSocket and string payloads in Node 本网络只提供一件事:能构建的样本。它在沙箱中运行并保留签名回执。它不评级、不担保——同样的代码能否在你的环境构建,它没有测量过。 HOWWebSocketWebSocket.prototype.onWebSocket.prototype.pingWebSocket.prototype.binaryTypeWebSocketServernode MIT-0 · 2026-08-14
- ws 8.21.3: Run a WebSocket server and client round trip with ws 本网络只提供一件事:能构建的样本。它在沙箱中运行并保留签名回执。它不评级、不担保——同样的代码能否在你的环境构建,它没有测量过。 HOWWebSocketServerWebSocketnode 22 MIT-0 · 2026-08-13
- ws 8.21.3: Why socket.io-client cannot talk to a plain WebSocket server due to Engine.IO handshake and Socket.IO wire framing 本网络只提供一件事:能构建的样本。它在沙箱中运行并保留签名回执。它不评级、不担保——同样的代码能否在你的环境构建,它没有测量过。 HOWioWebSocketServernode MIT-0 · 2026-08-16
- ws 8.21.3: WebSocketServer 本网络只提供一件事:能构建的样本。它在沙箱中运行并保留签名回执。它不评级、不担保——同样的代码能否在你的环境构建,它没有测量过。 HOWws.WebSocketServer MIT-0 · 2026-08-23
兼容性矩阵
项目级观测与符号/契约验证分别统计,绝不合并。
这些计数不区分符号的调用方式:重载、参数形态和选项被合并统计。某一具体调用方式的行为由样本的契约证明,而不是由这些数字证明。
| 环境 | 置信度 | 观测 | 验证 | 通过率 | 节点 | 最近观测 |
|---|---|---|---|---|---|---|
| node 22 · JS · npm · linux musl · docker
验证: CONTRACT 1✓
|
LOW | 0 | 1 | 100% | 0 · 1✓ | 2026-08-23 |
| node 22 · JS · npm · linux glibc · docker
观测: PROJECT_TEST 1✓ — 验证: CONTRACT 1✓
|
LOW | 1 | 1 | 100% | 1 · 1✓ | 2026-09-07 |
| node 22.23 · JS · npm · linux glibc
观测: PROJECT_PROCESS 8✓ 5✕
|
ELEVATED FAILURE | 13 | 0 | 62% | 2 | 2026-08-31 |
| node 24.13 · JS · npm · windows
观测: PROJECT_PROCESS 6✓
|
LOW | 6 | 0 | 100% | 1 | 2026-08-19 |
snapshot · 2026-09-15
失败聚类
-
已观测 PROJECT_PROCESS ERR_ASSERTION 证据缺口 ×17 8.21.3 executionContext=node证据质量: legacy-evidence-incomplete · 环境变体: 3 · 首次记录: 2026-08-18 · 最近观测: 2026-08-27诊断复验候选
-
已观测 PROJECT_PROCESS ERR_ASSERTION 证据缺口 ×5 8.21.3 executionContext=node · moduleSystem=cjs · os=linux · runtime=node@22.23 ws.WebSocketServer证据质量: legacy-evidence-incomplete · 环境变体: 1 · 首次记录: 2026-08-27 · 最近观测: 2026-08-27诊断复验候选
-
已观测 PROJECT_TEST ENOENT 证据缺口 ×2 8.21.1 → 8.21.3 executionContext=node · os=windows · runtime=node@24.13证据质量: legacy-evidence-incomplete · 环境变体: 2 · 首次记录: 2026-08-18 · 最近观测: 2026-08-21诊断复验候选
-
已观测 UNKNOWN exit 1 ERR_ASSERTION 证据缺口 ×2 8.21.3 executionContext=node · moduleSystem=cjs · os=linux · runtime=node@22.23 sha256:deb29d18a641…Test failed: AssertionError [ERR_ASSERTION]: Expected values to be strictly equal: · + actual - expected · + <str> · - <str>node · unclassified-diagnostic · outer node · gap stage-unknown证据质量: complete · 环境变体: 1 · 首次记录: 2026-08-29 · 最近观测: 2026-08-29诊断复验候选
-
已观测 UNKNOWN exit 1 证据缺口 ×2 8.21.3 executionContext=node · moduleSystem=cjs · os=linux · runtime=node@22.23 sha256:91ad26545eb1…node:internal/modules/cjs/loader:<n> · throw err; · ^ · Error: Cannot find module <str>node · unclassified-diagnostic · outer node · gap stage-unknown证据质量: complete · 环境变体: 1 · 首次记录: 2026-08-31 · 最近观测: 2026-08-31诊断复验候选
-
已观测 UNKNOWN exit 1 ERR_ASSERTION 证据缺口 ×2 8.21.3 executionContext=node · moduleSystem=esm · os=linux · runtime=node@22.23 sha256:986d98189e70…node:internal/modules/run_main:<n> · triggerUncaughtException( · ^ · AssertionError [ERR_ASSERTION]: Expected values to be strictly equal:node · unclassified-diagnostic · outer node · gap stage-unknown证据质量: complete · 环境变体: 1 · 首次记录: 2026-08-31 · 最近观测: 2026-08-31诊断复验候选
-
已观测 UNKNOWN exit 1 ERR_ASSERTION 证据缺口 ×1 8.21.3 executionContext=node · moduleSystem=cjs · os=linux · runtime=node@22.23 sha256:3ad0f21f8b08…Contract test failed: AssertionError [ERR_ASSERTION]: Expected values to be strictly equal: · + actual - expected · + <str> · - <str>node · unclassified-diagnostic · outer node · gap stage-unknown证据质量: complete · 环境变体: 1 · 首次记录: 2026-08-29 · 最近观测: 2026-08-29诊断复验候选
-
已观测 UNKNOWN exit 1 ERR_ASSERTION 证据缺口 ×1 8.21.3 executionContext=node · moduleSystem=esm · os=linux · runtime=node@22.23 sha256:c38a78d344c3…Contract verification failed: AssertionError [ERR_ASSERTION]: Expected values to be strictly equal: · + actual - expected · + [Function: createRoot$1] …node · unclassified-diagnostic · outer node · gap stage-unknown证据质量: complete · 环境变体: 1 · 首次记录: 2026-08-31 · 最近观测: 2026-08-31诊断复验候选
-
已观测 UNKNOWN exit 13 证据缺口 ×1 8.21.3 executionContext=node · moduleSystem=esm · os=linux · runtime=node@22.23 sha256:039a342da574…Warning: Detected unsettled top-level await at <url> · await new Promise((resolve) => { · ^ · Testing JSDOM ResourceLoader capabilities...node · unclassified-diagnostic · outer node · gap stage-unknown证据质量: complete · 环境变体: 1 · 首次记录: 2026-08-31 · 最近观测: 2026-08-31诊断复验候选
-
已观测 UNKNOWN exit 1 ERR_ASSERTION 证据缺口 ×1 8.21.3 executionContext=node · moduleSystem=esm · os=linux · runtime=node@22.23 sha256:0aab47d72aec…node:internal/modules/run_main:<n> · triggerUncaughtException( · ^ …node · unclassified-diagnostic · outer node · gap stage-unknown证据质量: complete · 环境变体: 1 · 首次记录: 2026-08-31 · 最近观测: 2026-08-31诊断复验候选
-
已观测 UNKNOWN exit 13 证据缺口 ×1 8.21.3 executionContext=node · moduleSystem=esm · os=linux · runtime=node@22.23 sha256:e05fc6863dbb…Warning: Detected unsettled top-level await at <url> · await new Promise((resolve) => { · ^ · Testing full ResourceLoader contract suite...node · unclassified-diagnostic · outer node · gap stage-unknown证据质量: complete · 环境变体: 1 · 首次记录: 2026-08-31 · 最近观测: 2026-08-31诊断复验候选
-
已观测 UNKNOWN exit 1 ERR_ASSERTION 证据缺口 ×1 8.21.3 executionContext=node · moduleSystem=esm · os=linux · runtime=node@22.23 sha256:e6dc9227296b…node:internal/modules/run_main:<n> · triggerUncaughtException( · ^ · AssertionError [ERR_ASSERTION]: Values have same structure but are not reference-equal:node · unclassified-diagnostic · outer node · gap stage-unknown证据质量: complete · 环境变体: 1 · 首次记录: 2026-08-31 · 最近观测: 2026-08-31诊断复验候选
显示报告最多的 12 个。此坐标记录的失败聚类共 13 个。其余为单次报告。