Aufzeichnungennpmws8.21.3ws.WebSocketServer
OS × Runtime auf einen Blick
Eine Zelle lesen: Die Zahl sind die aufgezeichneten Beobachtungen, durch die die Rate teilt — ein Build hinterlässt pro erreichter Stufe eine Beobachtung, also zählt sie weder Builds noch Maschinen noch Personen. Das Dokument daneben ist eine andere Tatsache aus einer anderen Quelle: ob an dieser Koordinate ein Sample existiert und wie unser eigener Lauf davon dort ausging.
- an dieser Koordinate noch kein Sample
- hier gibt es ein Sample, und wir haben es an dieser Koordinate noch nicht ausgeführt
- hier gibt es ein Sample, und unser Lauf an dieser Koordinate kam sauber zurück
- hier gibt es ein Sample, und unser Lauf an dieser Koordinate ist fehlgeschlagen
- hier gibt es ein Sample, und an dieser Koordinate sind ein bestandener und ein fehlgeschlagener Lauf verzeichnet
- nichts aufgezeichnet — unbekannt, weder „funktioniert“ noch „defekt“
- unter dieser Zelle liegt eine Ebene — zum Öffnen klicken
Ein Dokument bedeutet: An dieser Koordinate gibt es ein Sample. DASS es existiert, ist eine Aussage über diese Version und diese API und ändert sich nicht mit Betriebssystem, Runtime oder Paketmanager; seine FARBE sagt, wie dieses Sample in der Umgebung gelaufen ist, die Sie gerade ansehen.
Veröffentlichte Beispiele
- ws 8.21.3: Distinguish ws package EventEmitter API and Buffer payloads from native WHATWG EventTarget WebSocket and string payloads in Node Dieses Netzwerk bietet eine Sache: ein Sample, das baut. Es hat es in einer Sandbox ausgeführt und die signierte Quittung behalten. Es bewertet nichts und garantiert nichts — ob derselbe Code bei Ihnen baut, hat es nicht gemessen. HOWWebSocketWebSocket.prototype.onWebSocket.prototype.pingWebSocket.prototype.binaryTypeWebSocketServernode MIT-0 · 2026-08-14
- ws 8.21.3: Run a WebSocket server and client round trip with ws Dieses Netzwerk bietet eine Sache: ein Sample, das baut. Es hat es in einer Sandbox ausgeführt und die signierte Quittung behalten. Es bewertet nichts und garantiert nichts — ob derselbe Code bei Ihnen baut, hat es nicht gemessen. HOWWebSocketServerWebSocketnode 22 MIT-0 · 2026-08-13
- ws 8.21.3: Why socket.io-client cannot talk to a plain WebSocket server due to Engine.IO handshake and Socket.IO wire framing Dieses Netzwerk bietet eine Sache: ein Sample, das baut. Es hat es in einer Sandbox ausgeführt und die signierte Quittung behalten. Es bewertet nichts und garantiert nichts — ob derselbe Code bei Ihnen baut, hat es nicht gemessen. HOWioWebSocketServernode MIT-0 · 2026-08-16
- ws 8.21.3: WebSocketServer Dieses Netzwerk bietet eine Sache: ein Sample, das baut. Es hat es in einer Sandbox ausgeführt und die signierte Quittung behalten. Es bewertet nichts und garantiert nichts — ob derselbe Code bei Ihnen baut, hat es nicht gemessen. HOWws.WebSocketServer MIT-0 · 2026-08-23
Kompatibilitätsmatrix
Beobachtungen auf Projektebene und Symbol-/Contract-Verifizierungen werden getrennt gezählt und niemals zusammengerechnet.
Diese Zahlen unterscheiden nicht, wie das Symbol aufgerufen wurde: Überladungen, Argumentformen und Optionen werden zusammengefasst. Was eine bestimmte Aufrufform tut, beweist der Vertrag eines Samples – nicht diese Zahlen.
| Umgebung | Konfidenz | Beobachtungen | Verifiziert | Erfolgsquote | Peers | Zuletzt gesehen |
|---|---|---|---|---|---|---|
| node 22 · JS · npm · linux musl · docker
Verifiziert: CONTRACT 1✓
|
LOW | 0 | 1 | 100 % | 0 · 1✓ | 2026-08-23 |
| node 22 · JS · npm · linux glibc · docker
Beobachtungen: PROJECT_TEST 1✓ — Verifiziert: CONTRACT 1✓
|
LOW | 1 | 1 | 100 % | 1 · 1✓ | 2026-09-07 |
| node 22.23 · JS · npm · linux glibc
Beobachtungen: PROJECT_PROCESS 8✓ 5✕
|
ELEVATED FAILURE | 13 | 0 | 62 % | 2 | 2026-08-31 |
| node 24.13 · JS · npm · windows
Beobachtungen: PROJECT_PROCESS 6✓
|
LOW | 6 | 0 | 100 % | 1 | 2026-08-19 |
snapshot · 2026-09-15
Fehler-Cluster
-
beobachtet PROJECT_PROCESS ERR_ASSERTION Beweislücke ×17 8.21.3 executionContext=nodeBeweisqualität: legacy-evidence-incomplete · Umgebungsvarianten: 3 · Zuerst erfasst: 2026-08-18 · Zuletzt gesehen: 2026-08-27Kandidat für diagnostische Neuprüfung
-
beobachtet PROJECT_PROCESS ERR_ASSERTION Beweislücke ×5 8.21.3 executionContext=node · moduleSystem=cjs · os=linux · runtime=node@22.23 ws.WebSocketServerBeweisqualität: legacy-evidence-incomplete · Umgebungsvarianten: 1 · Zuerst erfasst: 2026-08-27 · Zuletzt gesehen: 2026-08-27Kandidat für diagnostische Neuprüfung
-
beobachtet PROJECT_TEST ENOENT Beweislücke ×2 8.21.1 → 8.21.3 executionContext=node · os=windows · runtime=node@24.13Beweisqualität: legacy-evidence-incomplete · Umgebungsvarianten: 2 · Zuerst erfasst: 2026-08-18 · Zuletzt gesehen: 2026-08-21Kandidat für diagnostische Neuprüfung
-
beobachtet UNKNOWN exit 1 ERR_ASSERTION Beweislücke ×2 8.21.3 executionContext=node · moduleSystem=cjs · os=linux · runtime=node@22.23 sha256:deb29d18a641…Test failed: AssertionError [ERR_ASSERTION]: Expected values to be strictly equal: · + actual - expected · + <str> · - <str>node · unclassified-diagnostic · outer node · gap stage-unknownBeweisqualität: complete · Umgebungsvarianten: 1 · Zuerst erfasst: 2026-08-29 · Zuletzt gesehen: 2026-08-29Kandidat für diagnostische Neuprüfung
-
beobachtet UNKNOWN exit 1 Beweislücke ×2 8.21.3 executionContext=node · moduleSystem=cjs · os=linux · runtime=node@22.23 sha256:91ad26545eb1…node:internal/modules/cjs/loader:<n> · throw err; · ^ · Error: Cannot find module <str>node · unclassified-diagnostic · outer node · gap stage-unknownBeweisqualität: complete · Umgebungsvarianten: 1 · Zuerst erfasst: 2026-08-31 · Zuletzt gesehen: 2026-08-31Kandidat für diagnostische Neuprüfung
-
beobachtet UNKNOWN exit 1 ERR_ASSERTION Beweislücke ×2 8.21.3 executionContext=node · moduleSystem=esm · os=linux · runtime=node@22.23 sha256:986d98189e70…node:internal/modules/run_main:<n> · triggerUncaughtException( · ^ · AssertionError [ERR_ASSERTION]: Expected values to be strictly equal:node · unclassified-diagnostic · outer node · gap stage-unknownBeweisqualität: complete · Umgebungsvarianten: 1 · Zuerst erfasst: 2026-08-31 · Zuletzt gesehen: 2026-08-31Kandidat für diagnostische Neuprüfung
-
beobachtet UNKNOWN exit 1 ERR_ASSERTION Beweislücke ×1 8.21.3 executionContext=node · moduleSystem=cjs · os=linux · runtime=node@22.23 sha256:3ad0f21f8b08…Contract test failed: AssertionError [ERR_ASSERTION]: Expected values to be strictly equal: · + actual - expected · + <str> · - <str>node · unclassified-diagnostic · outer node · gap stage-unknownBeweisqualität: complete · Umgebungsvarianten: 1 · Zuerst erfasst: 2026-08-29 · Zuletzt gesehen: 2026-08-29Kandidat für diagnostische Neuprüfung
-
beobachtet UNKNOWN exit 1 ERR_ASSERTION Beweislücke ×1 8.21.3 executionContext=node · moduleSystem=esm · os=linux · runtime=node@22.23 sha256:c38a78d344c3…Contract verification failed: AssertionError [ERR_ASSERTION]: Expected values to be strictly equal: · + actual - expected · + [Function: createRoot$1] …node · unclassified-diagnostic · outer node · gap stage-unknownBeweisqualität: complete · Umgebungsvarianten: 1 · Zuerst erfasst: 2026-08-31 · Zuletzt gesehen: 2026-08-31Kandidat für diagnostische Neuprüfung
-
beobachtet UNKNOWN exit 13 Beweislücke ×1 8.21.3 executionContext=node · moduleSystem=esm · os=linux · runtime=node@22.23 sha256:039a342da574…Warning: Detected unsettled top-level await at <url> · await new Promise((resolve) => { · ^ · Testing JSDOM ResourceLoader capabilities...node · unclassified-diagnostic · outer node · gap stage-unknownBeweisqualität: complete · Umgebungsvarianten: 1 · Zuerst erfasst: 2026-08-31 · Zuletzt gesehen: 2026-08-31Kandidat für diagnostische Neuprüfung
-
beobachtet UNKNOWN exit 1 ERR_ASSERTION Beweislücke ×1 8.21.3 executionContext=node · moduleSystem=esm · os=linux · runtime=node@22.23 sha256:0aab47d72aec…node:internal/modules/run_main:<n> · triggerUncaughtException( · ^ …node · unclassified-diagnostic · outer node · gap stage-unknownBeweisqualität: complete · Umgebungsvarianten: 1 · Zuerst erfasst: 2026-08-31 · Zuletzt gesehen: 2026-08-31Kandidat für diagnostische Neuprüfung
-
beobachtet UNKNOWN exit 13 Beweislücke ×1 8.21.3 executionContext=node · moduleSystem=esm · os=linux · runtime=node@22.23 sha256:e05fc6863dbb…Warning: Detected unsettled top-level await at <url> · await new Promise((resolve) => { · ^ · Testing full ResourceLoader contract suite...node · unclassified-diagnostic · outer node · gap stage-unknownBeweisqualität: complete · Umgebungsvarianten: 1 · Zuerst erfasst: 2026-08-31 · Zuletzt gesehen: 2026-08-31Kandidat für diagnostische Neuprüfung
-
beobachtet UNKNOWN exit 1 ERR_ASSERTION Beweislücke ×1 8.21.3 executionContext=node · moduleSystem=esm · os=linux · runtime=node@22.23 sha256:e6dc9227296b…node:internal/modules/run_main:<n> · triggerUncaughtException( · ^ · AssertionError [ERR_ASSERTION]: Values have same structure but are not reference-equal:node · unclassified-diagnostic · outer node · gap stage-unknownBeweisqualität: complete · Umgebungsvarianten: 1 · Zuerst erfasst: 2026-08-31 · Zuletzt gesehen: 2026-08-31Kandidat für diagnostische Neuprüfung
Es werden die 12 meistgemeldeten von 13 aufgezeichneten Fehlerclustern gezeigt. Der Rest sind Einzelmeldungen.