Записиnpmrollup4.63.1rollup.rollup
Матрица совместимости
Наблюдения уровня проекта и проверки символов/контрактов считаются раздельно и никогда не суммируются.
Эти числа не различают, как именно был вызван символ: перегрузки, наборы аргументов и опции считаются вместе. Что делает конкретная форма вызова, доказывает контракт образца, а не эти цифры.
| Окружение | Достоверность | Наблюдения | Проверено | Доля успешных | Пиры | Последнее наблюдение |
|---|---|---|---|---|---|---|
| node 22.23 · JS · npm · linux glibc
Наблюдения: PROJECT_PROCESS 10✓ — Проверено: UNKNOWN 0✓ 7✕
|
ELEVATED FAILURE | 10 | 7 | 59 % | 2 | 2026-09-03 |
snapshot · 2026-09-15
Кластеры сбоев
-
наблюдалось PROCESS_START process start failed Пробел в данных ×40 4.62.4 → 4.63.0 → 4.63.1 → 4.63.2 executionContext=node sha256:c12549970456…· structured-termination · gap diagnostic-missingКачество данных: partial · Варианты среды: 3 · Первая запись: 2026-08-31 · Последнее наблюдение: 2026-09-16Кандидат на диагностическую перепроверку
-
наблюдалось UNKNOWN exit 1 ERR_MODULE_NOT_FOUND Пробел в данных ×5 4.63.1 → 4.63.2 executionContext=node · moduleSystem=cjs · os=linux · runtime=node@22.23 rollup.rollup sha256:88af852f99a8…node:internal/modules/package_json_reader:<n> · throw new ERR_MODULE_NOT_FOUND(packageName, fileURLToPath(base), null); · ^ …node · unclassified-diagnostic · outer node · gap stage-unknownКачество данных: complete · Варианты среды: 1 · Первая запись: 2026-09-03 · Последнее наблюдение: 2026-09-14Кандидат на диагностическую перепроверку
-
наблюдалось UNKNOWN exit 1 ERR_ASSERTION Пробел в данных ×4 4.63.1 executionContext=node · os=linux · runtime=node@22.23 sha256:986d98189e70…node:internal/modules/run_main:<n> · triggerUncaughtException( · ^ · AssertionError [ERR_ASSERTION]: Expected values to be strictly equal:node · unclassified-diagnostic · outer node · gap stage-unknownКачество данных: complete · Варианты среды: 2 · Первая запись: 2026-09-03 · Последнее наблюдение: 2026-09-05Кандидат на диагностическую перепроверку
-
наблюдалось UNKNOWN exit 1 Пробел в данных ×3 4.63.1 executionContext=node · moduleSystem=esm · os=linux · runtime=node@22.23 sha256:8fd30f2a6304…fil<path>:<n> · throw new Error(errorMsg); · ^ · Error: Vitest failed to access its internal state.node · unclassified-diagnostic · outer node · gap stage-unknownКачество данных: complete · Варианты среды: 1 · Первая запись: 2026-08-31 · Последнее наблюдение: 2026-09-08Кандидат на диагностическую перепроверку
-
наблюдалось UNKNOWN exit 1 Пробел в данных ×2 4.63.0 → 4.63.1 executionContext=node · moduleSystem=cjs · os=linux · runtime=node@22.23 sha256:91ad26545eb1…node:internal/modules/cjs/loader:<n> · throw err; · ^ · Error: Cannot find module <str>node · unclassified-diagnostic · outer node · gap stage-unknownКачество данных: complete · Варианты среды: 1 · Первая запись: 2026-08-31 · Последнее наблюдение: 2026-09-07Кандидат на диагностическую перепроверку
-
наблюдалось UNKNOWN exit 1 ERR_ASSERTION Пробел в данных ×2 4.63.1 executionContext=node · moduleSystem=cjs · os=linux · runtime=node@22.23 rollup.rollup sha256:986d98189e70…node:internal/modules/run_main:<n> · triggerUncaughtException( · ^ · AssertionError [ERR_ASSERTION]: Expected values to be strictly equal:node · unclassified-diagnostic · outer node · gap stage-unknownКачество данных: complete · Варианты среды: 1 · Первая запись: 2026-09-03 · Последнее наблюдение: 2026-09-03Кандидат на диагностическую перепроверку
-
наблюдалось UNKNOWN exit 1 Пробел в данных ×1 4.63.1 executionContext=node · moduleSystem=cjs · os=linux · runtime=node@22.23 rollup.rollup sha256:0cd3a66e3ae2…Contract failed: Error: Unexpected require: <path> · at mockRequire (<url>) · at eval (eval at evaluateCjs (<url>), <anonymous>:<n>:<n>) …node · unclassified-diagnostic · outer node · gap stage-unknownКачество данных: complete · Варианты среды: 1 · Первая запись: 2026-09-03 · Последнее наблюдение: 2026-09-03Кандидат на диагностическую перепроверку
-
наблюдалось UNKNOWN exit 1 Пробел в данных ×1 4.63.1 executionContext=node · moduleSystem=cjs · os=linux · runtime=node@22.23 rollup.rollup sha256:b4964cdcf3b0…Contract failed: Error: Unexpected require: external-dep-b · at mockRequire (<url>) · at eval (eval at evaluateCjs (<url>), <anonymous>:<n>:<n>) …node · unclassified-diagnostic · outer node · gap stage-unknownКачество данных: complete · Варианты среды: 1 · Первая запись: 2026-09-03 · Последнее наблюдение: 2026-09-03Кандидат на диагностическую перепроверку
-
наблюдалось UNKNOWN exit 1 Пробел в данных ×1 4.63.1 executionContext=node · moduleSystem=esm · os=linux · runtime=node@22.23 sha256:42623a56826f…fil<path>:<n> · Object.defineProperty(expect.not, expectAssertionName, { · ^ · TypeError: Object.defineProperty called on non-objectnode · unclassified-diagnostic · outer node · gap stage-unknownКачество данных: complete · Варианты среды: 1 · Первая запись: 2026-09-04 · Последнее наблюдение: 2026-09-04Кандидат на диагностическую перепроверку
-
наблюдалось UNKNOWN exit 1 ERROR Пробел в данных ×1 4.63.1 executionContext=node · moduleSystem=cjs · os=linux · runtime=node@22.23 sha256:1f882fb2e944…✘ [ERROR] Could not resolve <str> · failed to load config from <path> · <path>:<n> · let error = new Error(text);node · unclassified-diagnostic · outer node · gap stage-unknownКачество данных: complete · Варианты среды: 1 · Первая запись: 2026-09-04 · Последнее наблюдение: 2026-09-04Кандидат на диагностическую перепроверку
-
наблюдалось UNKNOWN exit 1 ERR_ASSERTION Пробел в данных ×1 4.63.1 executionContext=node · moduleSystem=esm · os=linux · runtime=node@22.23 sha256:ac1a96fa941c…Contract test failed: AssertionError [ERR_ASSERTION]: out/preload/index.js must be created by build · at run (<url>) { · generatedMessage: false, …node · unclassified-diagnostic · outer node · gap stage-unknownКачество данных: complete · Варианты среды: 1 · Первая запись: 2026-09-06 · Последнее наблюдение: 2026-09-06Кандидат на диагностическую перепроверку
-
наблюдалось UNKNOWN exit 1 Пробел в данных ×1 4.63.1 executionContext=node · moduleSystem=cjs · os=linux · runtime=node@22.23 sha256:148f04041544…atomic: true, · followSymlinks: true, · awaitWriteFinish: false · },node · unclassified-diagnostic · outer node · gap stage-unknownКачество данных: complete · Варианты среды: 1 · Первая запись: 2026-09-07 · Последнее наблюдение: 2026-09-07Кандидат на диагностическую перепроверку
Показаны 12 наиболее часто сообщаемых из 20 записанных кластеров отказов. Остальные — единичные сообщения.