記録npmrollup4.63.1rollup.rollup
互換性マトリクス
プロジェクトレベルの観測とシンボル/コントラクト検証は別々に集計し、決して合算しません。
これらの数値は、シンボルがどう呼び出されたかを区別しません。オーバーロード、引数の形、オプションはまとめて集計されます。特定の呼び出し方がどう動くかは、この数値ではなくサンプルの契約が証明します。
| 環境 | 信頼度 | 観測 | 検証 | 成功率 | ピア | 最終観測 |
|---|---|---|---|---|---|---|
| node 22.23 · JS · npm · linux glibc
観測: PROJECT_PROCESS 10✓ — 検証: UNKNOWN 0✓ 7✕
|
ELEVATED FAILURE | 10 | 7 | 59% | 2 | 2026-09-03 |
snapshot · 2026-09-15
失敗クラスター
-
観測済み PROCESS_START process start failed 証拠の欠落 ×40 4.62.4 → 4.63.0 → 4.63.1 → 4.63.2 executionContext=node sha256:c12549970456…· structured-termination · gap diagnostic-missing証拠品質: partial · 環境バリアント: 3 · 初回記録: 2026-08-31 · 最終観測: 2026-09-16診断再検証候補
-
観測済み UNKNOWN exit 1 ERR_MODULE_NOT_FOUND 証拠の欠落 ×5 4.63.1 → 4.63.2 executionContext=node · moduleSystem=cjs · os=linux · runtime=node@22.23 rollup.rollup sha256:88af852f99a8…node:internal/modules/package_json_reader:<n> · throw new ERR_MODULE_NOT_FOUND(packageName, fileURLToPath(base), null); · ^ …node · unclassified-diagnostic · outer node · gap stage-unknown証拠品質: complete · 環境バリアント: 1 · 初回記録: 2026-09-03 · 最終観測: 2026-09-14診断再検証候補
-
観測済み UNKNOWN exit 1 ERR_ASSERTION 証拠の欠落 ×4 4.63.1 executionContext=node · os=linux · runtime=node@22.23 sha256:986d98189e70…node:internal/modules/run_main:<n> · triggerUncaughtException( · ^ · AssertionError [ERR_ASSERTION]: Expected values to be strictly equal:node · unclassified-diagnostic · outer node · gap stage-unknown証拠品質: complete · 環境バリアント: 2 · 初回記録: 2026-09-03 · 最終観測: 2026-09-05診断再検証候補
-
観測済み UNKNOWN exit 1 証拠の欠落 ×3 4.63.1 executionContext=node · moduleSystem=esm · os=linux · runtime=node@22.23 sha256:8fd30f2a6304…fil<path>:<n> · throw new Error(errorMsg); · ^ · Error: Vitest failed to access its internal state.node · unclassified-diagnostic · outer node · gap stage-unknown証拠品質: complete · 環境バリアント: 1 · 初回記録: 2026-08-31 · 最終観測: 2026-09-08診断再検証候補
-
観測済み UNKNOWN exit 1 証拠の欠落 ×2 4.63.0 → 4.63.1 executionContext=node · moduleSystem=cjs · os=linux · runtime=node@22.23 sha256:91ad26545eb1…node:internal/modules/cjs/loader:<n> · throw err; · ^ · Error: Cannot find module <str>node · unclassified-diagnostic · outer node · gap stage-unknown証拠品質: complete · 環境バリアント: 1 · 初回記録: 2026-08-31 · 最終観測: 2026-09-07診断再検証候補
-
観測済み UNKNOWN exit 1 ERR_ASSERTION 証拠の欠落 ×2 4.63.1 executionContext=node · moduleSystem=cjs · os=linux · runtime=node@22.23 rollup.rollup sha256:986d98189e70…node:internal/modules/run_main:<n> · triggerUncaughtException( · ^ · AssertionError [ERR_ASSERTION]: Expected values to be strictly equal:node · unclassified-diagnostic · outer node · gap stage-unknown証拠品質: complete · 環境バリアント: 1 · 初回記録: 2026-09-03 · 最終観測: 2026-09-03診断再検証候補
-
観測済み UNKNOWN exit 1 証拠の欠落 ×1 4.63.1 executionContext=node · moduleSystem=cjs · os=linux · runtime=node@22.23 rollup.rollup sha256:0cd3a66e3ae2…Contract failed: Error: Unexpected require: <path> · at mockRequire (<url>) · at eval (eval at evaluateCjs (<url>), <anonymous>:<n>:<n>) …node · unclassified-diagnostic · outer node · gap stage-unknown証拠品質: complete · 環境バリアント: 1 · 初回記録: 2026-09-03 · 最終観測: 2026-09-03診断再検証候補
-
観測済み UNKNOWN exit 1 証拠の欠落 ×1 4.63.1 executionContext=node · moduleSystem=cjs · os=linux · runtime=node@22.23 rollup.rollup sha256:b4964cdcf3b0…Contract failed: Error: Unexpected require: external-dep-b · at mockRequire (<url>) · at eval (eval at evaluateCjs (<url>), <anonymous>:<n>:<n>) …node · unclassified-diagnostic · outer node · gap stage-unknown証拠品質: complete · 環境バリアント: 1 · 初回記録: 2026-09-03 · 最終観測: 2026-09-03診断再検証候補
-
観測済み UNKNOWN exit 1 証拠の欠落 ×1 4.63.1 executionContext=node · moduleSystem=esm · os=linux · runtime=node@22.23 sha256:42623a56826f…fil<path>:<n> · Object.defineProperty(expect.not, expectAssertionName, { · ^ · TypeError: Object.defineProperty called on non-objectnode · unclassified-diagnostic · outer node · gap stage-unknown証拠品質: complete · 環境バリアント: 1 · 初回記録: 2026-09-04 · 最終観測: 2026-09-04診断再検証候補
-
観測済み UNKNOWN exit 1 ERROR 証拠の欠落 ×1 4.63.1 executionContext=node · moduleSystem=cjs · os=linux · runtime=node@22.23 sha256:1f882fb2e944…✘ [ERROR] Could not resolve <str> · failed to load config from <path> · <path>:<n> · let error = new Error(text);node · unclassified-diagnostic · outer node · gap stage-unknown証拠品質: complete · 環境バリアント: 1 · 初回記録: 2026-09-04 · 最終観測: 2026-09-04診断再検証候補
-
観測済み UNKNOWN exit 1 ERR_ASSERTION 証拠の欠落 ×1 4.63.1 executionContext=node · moduleSystem=esm · os=linux · runtime=node@22.23 sha256:ac1a96fa941c…Contract test failed: AssertionError [ERR_ASSERTION]: out/preload/index.js must be created by build · at run (<url>) { · generatedMessage: false, …node · unclassified-diagnostic · outer node · gap stage-unknown証拠品質: complete · 環境バリアント: 1 · 初回記録: 2026-09-06 · 最終観測: 2026-09-06診断再検証候補
-
観測済み UNKNOWN exit 1 証拠の欠落 ×1 4.63.1 executionContext=node · moduleSystem=cjs · os=linux · runtime=node@22.23 sha256:148f04041544…atomic: true, · followSymlinks: true, · awaitWriteFinish: false · },node · unclassified-diagnostic · outer node · gap stage-unknown証拠品質: complete · 環境バリアント: 1 · 初回記録: 2026-09-07 · 最終観測: 2026-09-07診断再検証候補
最も多く報告された 12 件を表示しています。この座標に記録された失敗クラスタは 20 件です。残りは単発の報告です。