记录npmip-address10.7.0
哪个符号在哪里跑过
此版本的符号 × 操作系统。单元格可钻入该包的兼容性立方体。
4 3○ 12026-09-17
| debian glibc | ubuntu glibc | |
|---|---|---|
| Address6.endAddress | 100%1 | |
| Address6.fromAddress4 | 100%1 | |
| AddressError | 100%1 | 100%3 |
| ip-address.Address4 | 100%1 | 100%3 |
| ip-address.Address6 | 100%5 | |
| ip-address.AddressError | 100%3 |
仅显示证据最多的环境。
如何阅读单元格: 数字是该比率所依据的已记录观测次数——一次构建每到达一个阶段就留下一条观测,因此它既不是构建数,也不是机器数或人数。旁边的文档是另一个来源不同的事实:该坐标是否有样例,以及我们在那里运行它的结果。
- 该坐标还没有样例
- 有样例 — 我们尚未在该坐标运行过它
- 有样例 — 我们在该坐标运行过,并且干净地结束
- 有样例 — 我们在该坐标运行过,并且失败了
- 有样例 — 该坐标同时记录了通过的和失败的运行
- 没有记录 — 未知,既非“可用”也非“损坏”
- 这一格下面还有层级 — 点击打开
有文档,就说明该坐标有样例。样例是否存在,是关于这个版本和这个 API 的事实,不随操作系统、运行时或包管理器改变;颜色说的是它在你正在看的那个环境里跑得怎么样。
环境详情
项目级观测与符号/契约验证分别统计,绝不合并。
这些计数不区分符号的调用方式:重载、参数形态和选项被合并统计。某一具体调用方式的行为由样本的契约证明,而不是由这些数字证明。
| 环境 | 置信度 | 观测 | 验证 | 通过率 | 节点 | 最近观测 |
|---|---|---|---|---|---|---|
| node 22 · JS · npm · linux glibc · docker
观测: PROJECT_LOAD 2✓ · PROJECT_TEST 2✓ — 使用: USED 2✓ — 验证: CONTRACT 2✓
|
LOW | 4 +2 | 2 | 100% | 1 · 1✓ | 2026-09-17 |
| node 22 · JS · npm · linux glibc · docker
观测: PROJECT_LOAD 2✓ · PROJECT_TEST 2✓ — 使用: USED 2✓ — 验证: CONTRACT 6✓
|
LOW | 4 +2 | 6 | 100% | 1 · 1✓ | 2026-09-17 |
| node 22.23 · JS · npm · linux glibc
观测: PROJECT_PROCESS 45✓ — 使用: USED 5✓ — 验证: UNKNOWN 0✓ 9✕
|
MEDIUM | 45 +5 | 9 | 83% | 3 | 2026-09-07 |
| node 22.23 · JS · npm · linux glibc
观测: PROJECT_PROCESS 11✓ — 使用: USED 3✓
|
MEDIUM | 11 +3 | 0 | 100% | 2 | 2026-09-14 |
近期失败聚类
-
已观测 UNKNOWN exit 1 证据缺口 ×6 10.4.0 → 10.5.0 → 10.7.0 executionContext=node · moduleSystem=cjs · os=linux · runtime=node@22.23 sha256:91ad26545eb1…node:internal/modules/cjs/loader:<n> · throw err; · ^ · Error: Cannot find module <str>node · unclassified-diagnostic · outer node · gap stage-unknown证据质量: complete · 环境变体: 1 · 首次记录: 2026-08-30 · 最近观测: 2026-09-07诊断复验候选
-
已观测 UNKNOWN exit 1 证据缺口 ×1 10.7.0 executionContext=node · moduleSystem=cjs · os=linux · runtime=node@22.23 sha256:d2d7a684aeb0…<url>]:<n> · console.log(<str>, addr.toBigInt().toString(16)); · ^ · TypeError: addr.toBigInt is not a functionnode · unclassified-diagnostic · outer node · gap stage-unknown证据质量: complete · 环境变体: 1 · 首次记录: 2026-09-07 · 最近观测: 2026-09-07诊断复验候选
-
已观测 UNKNOWN exit 1 证据缺口 ×1 10.7.0 executionContext=node · moduleSystem=cjs · os=linux · runtime=node@22.23 sha256:e5f751e72b4c…<path>:<n> · if (address.indexOf(<str>) === -1) { · ^ · TypeError: address.indexOf is not a functionnode · unclassified-diagnostic · outer node · gap stage-unknown证据质量: complete · 环境变体: 1 · 首次记录: 2026-09-07 · 最近观测: 2026-09-07诊断复验候选
-
已观测 UNKNOWN exit 1 ERR_ASSERTION 证据缺口 ×1 10.7.0 executionContext=node · moduleSystem=cjs · os=linux · runtime=node@22.23 sha256:0ab3a7004d66…node:assert:<n> · throw new AssertionError(obj); · ^ · AssertionError [ERR_ASSERTION]: Expected values to be strictly equal:node · unclassified-diagnostic · outer node · gap stage-unknown证据质量: complete · 环境变体: 1 · 首次记录: 2026-09-07 · 最近观测: 2026-09-07诊断复验候选
-
已观测 UNKNOWN exit 1 ERR_ASSERTION 证据缺口 ×1 10.7.0 executionContext=node · moduleSystem=cjs · os=linux · runtime=node@22.23 sha256:0d62cac8c07a…AssertionError [ERR_ASSERTION]: Expected values to be strictly equal: · + actual - expected · + <str> · - <str>node · unclassified-diagnostic · outer node · gap stage-unknown证据质量: complete · 环境变体: 1 · 首次记录: 2026-09-07 · 最近观测: 2026-09-07诊断复验候选
-
已观测 UNKNOWN exit 1 证据缺口 ×1 10.7.0 executionContext=node · moduleSystem=cjs · os=linux · runtime=node@22.23 ip-address.Address6 sha256:2f5423e9a8a8…<path>:<n> · assert.equal(mapped.isValid(), true); · ^ · TypeError: mapped.isValid is not a functionnode · unclassified-diagnostic · outer node · gap stage-unknown证据质量: complete · 环境变体: 1 · 首次记录: 2026-09-07 · 最近观测: 2026-09-07诊断复验候选
-
已观测 UNKNOWN exit 1 ERR_ASSERTION 证据缺口 ×1 10.7.0 executionContext=node · moduleSystem=cjs · os=linux · runtime=node@22.23 sha256:719dc399517f…AssertionError [ERR_ASSERTION]: Expected values to be strictly equal: · 8080 !== 38853 · at runTests (<path>:<n>:<n>) …node · unclassified-diagnostic · outer node · gap stage-unknown证据质量: complete · 环境变体: 1 · 首次记录: 2026-09-07 · 最近观测: 2026-09-07诊断复验候选
-
已观测 UNKNOWN exit 1 ERR_ASSERTION 证据缺口 ×1 10.7.0 executionContext=node · moduleSystem=cjs · os=linux · runtime=node@22.23 sha256:821bb102fcd0…node:assert:<n> · throw err; · ^ · AssertionError [ERR_ASSERTION]: The input did not match the regular expression <path> of the internal SmartBuffer/. Input:node · unclassified-diagnostic · outer node · gap stage-unknown证据质量: complete · 环境变体: 1 · 首次记录: 2026-09-07 · 最近观测: 2026-09-07诊断复验候选
-
已观测 UNKNOWN exit 1 ERR_ASSERTION 证据缺口 ×1 10.7.0 executionContext=node · moduleSystem=cjs · os=linux · runtime=node@22.23 sha256:cf0f5652a811…Contract test failed: AssertionError [ERR_ASSERTION]: should reject non-connect command · at async testContract (<url>) { · generatedMessage: false, …node · unclassified-diagnostic · outer node · gap stage-unknown证据质量: complete · 环境变体: 1 · 首次记录: 2026-09-07 · 最近观测: 2026-09-07诊断复验候选
符号
- ip-address.Address4 1 1/1 次通过
- ip-address.Address6 0/1 次通过
- ip-address.AddressError 1 0/1 次通过
- Address6.endAddress 1 1/1 次通过
- Address6.fromAddress4 1 1/1 次通过
- Address6.fromURL 1 1/1 次通过
- Address6.isInSubnet 1 1/1 次通过
- Address6.startAddress 1 1/1 次通过
已发布的示例
- ip-address 10.7.0 本网络只提供一件事:能构建的样本。它在沙箱中运行并保留签名回执。它不评级、不担保——同样的代码能否在你的环境构建,它没有测量过。 HOW MIT-0 · 2026-09-07
- ip-address 10.7.0 本网络只提供一件事:能构建的样本。它在沙箱中运行并保留签名回执。它不评级、不担保——同样的代码能否在你的环境构建,它没有测量过。 HOW MIT-0 · 2026-09-07
- ip-address 10.7.0 本网络只提供一件事:能构建的样本。它在沙箱中运行并保留签名回执。它不评级、不担保——同样的代码能否在你的环境构建,它没有测量过。 HOW MIT-0 · 2026-09-07